Eric Milles <eric.milles@thomsonreuters.com>: Author Summary

Builds triggered by Eric Milles <eric.milles@thomsonreuters.com>

Builds triggered by an author are those builds which contains changes committed by the author.
1728
501 (29%)
1227 (71%)

Breakages and fixes

Broken means the build has failed but the previous build was successful.
Fixed means that the build was successful but the previous build has failed.
151 (9% of all builds triggered)
154 (9% of all builds triggered)
3
Build Completed Code commits Tests
GRECLIPSE › E43J8P › #379 6 hours ago
Fix for issue #315: IllegalStateException in JDTClassNode init members
1 of 4735 failed
GRECLIPSE › E44TP › #635 7 hours ago
Fix for issue #315: IllegalStateException in JDTClassNode init members
4570 passed
GRECLIPSE › GE45 › #363 9 hours ago
Fix for issue #315: IllegalStateException in JDTClassNode init members
4570 passed
GRECLIPSE › GE46 › #406 10 hours ago
Fix for issue #315: IllegalStateException in JDTClassNode init members
5038 passed
GRECLIPSE › GE47 › #233 10 hours ago
Fix for issue #315: IllegalStateException in JDTClassNode init members
5038 passed
GRECLIPSE › E37BTP › #82 2 days ago
Update the Groovy plug-in to 2.4.12
4562 passed
GRECLIPSE › TE42 › #166 2 days ago
Update the Groovy plug-in to 2.4.12
4563 passed
GRECLIPSE › TE43 › #347 2 days ago
Update the Groovy plug-in to 2.4.12
4563 passed
GRECLIPSE › E43J8P › #378 2 days ago
Update the Groovy plug-in to 2.4.12
4564 passed
GRECLIPSE › E44TP › #634 2 days ago
Update the Groovy plug-in to 2.4.12
4570 passed
Build Completed Code commits Tests
GRECLIPSE › E43J8P › #379 6 hours ago
Fix for issue #315: IllegalStateException in JDTClassNode init members
1 of 4735 failed
GRECLIPSE › TE43 › #344 1 week ago
Fix for properties seen in scripts
Build trigger
1 of 4734 failed
GRECLIPSE › GE47 › #229 1 week ago
Build trigger
2 of 5229 failed
GRECLIPSE › GE46 › #401 1 week ago
Fix for properties seen in scripts
1 of 5229 failed
GRECLIPSE › E37BTP › #79 1 week ago
Fix for waiting
Add back timed waiting
Add de-duplication of DSLD proposals
Try wildcards
Increased timeout
Fix for recent changes
Add job to skip list
Add wait for background jobs before creating sources or opening editors
Fix for AssertionFailedException
org.eclipse.core.runtime.AssertionFailedException: assertion failed:
        at org.eclipse.core.runtime.Assert.isTrue(Assert.java:110)
        at org.eclipse.core.runtime.Assert.isTrue(Assert.java:96)
        at
org.eclipse.ltk.core.refactoring.TextChange.setEdit(TextChange.java:103)
        at
org.codehaus.groovy.eclipse.quickassist.GroovyQuickAssistProposal2.toTextChange(GroovyQuickAssistProposal2.java:41)
        at
org.codehaus.groovy.eclipse.quickassist.proposals.ConvertMethodDefToClosureProposal.getTextChange(ConvertMethodDefToClosureProposal.java:55)
        at
org.codehaus.groovy.eclipse.quickassist.GroovyQuickAssistProposal2.getAdditionalProposalInfo(GroovyQuickAssistProposal2.java:49)
        at
org.eclipse.jface.text.contentassist.AdditionalInfoController$Timer$2$1.run(AdditionalInfoController.java:113)
        at org.eclipse.core.internal.jobs.Worker.run(Worker.java:56)
Refactor waiting
Fix for ArrayIndexOutOfBoundsException
java.lang.ArrayIndexOutOfBoundsException: 377
        at
org.codehaus.groovy.eclipse.codebrowsing.fragments.MethodCallFragment.getTrimmedEnd(MethodCallFragment.java:83)
        at
org.codehaus.groovy.eclipse.codebrowsing.fragments.PropertyExpressionFragment.getTrimmedEnd(PropertyExpressionFragment.java:64)
        at
org.codehaus.groovy.eclipse.codebrowsing.fragments.PropertyExpressionFragment.getTrimmedLength(PropertyExpressionFragment.java:68)
        at
org.codehaus.groovy.eclipse.refactoring.core.extract.ExtractGroovyLocalRefactoring.checkInitialConditions(ExtractGroovyLocalRefactoring.java:153)
        at
org.eclipse.ltk.core.refactoring.Refactoring.checkAllConditions(Refactoring.java:158)
        at
org.codehaus.groovy.eclipse.quickassist.proposals.ExtractToLocalProposal.getRelevance(ExtractToLocalProposal.java:65)
        at
org.codehaus.groovy.eclipse.quickassist.GroovyQuickAssist.getAssists(GroovyQuickAssist.java:97)
        at
org.codehaus.groovy.eclipse.quickassist.GroovyQuickAssist.hasAssists(GroovyQuickAssist.java:63)
        at
org.eclipse.jdt.internal.ui.text.correction.JavaCorrectionProcessor$SafeHasAssist.safeRun(JavaCorrectionProcessor.java:435)
        at
org.eclipse.jdt.internal.ui.text.correction.JavaCorrectionProcessor$SafeCorrectionProcessorAccess.run(JavaCorrectionProcessor.java:344)
        at org.eclipse.core.runtime.SafeRunner.run(SafeRunner.java:42)
        at
org.eclipse.jdt.internal.ui.text.correction.JavaCorrectionProcessor$SafeCorrectionProcessorAccess.process(JavaCorrectionProcessor.java:339)
        at
org.eclipse.jdt.internal.ui.text.correction.JavaCorrectionProcessor.hasAssists(JavaCorrectionProcessor.java:154)
        at
org.eclipse.jdt.internal.ui.text.correction.QuickAssistLightBulbUpdater.calculateLightBulb(QuickAssistLightBulbUpdater.java:227)
        at
org.eclipse.jdt.internal.ui.text.correction.QuickAssistLightBulbUpdater.doSelectionChanged(QuickAssistLightBulbUpdater.java:220)
        at
org.eclipse.jdt.internal.ui.text.correction.QuickAssistLightBulbUpdater.access$0(QuickAssistLightBulbUpdater.java:203)
        at
org.eclipse.jdt.internal.ui.text.correction.QuickAssistLightBulbUpdater$1.selectionChanged(QuickAssistLightBulbUpdater.java:128)
Method does not exist on e44
Prevent waiting on progress dialog
Change the wait loop
Disable auto-add of classpath container to prevent conflicts
Add jobs to skip list
Use simpler createProposalsAtOffset call in most cases
Increase timeout
Add print of waiting
Fix for issue #303: DSL tests should run now
Reduce build timeout to 2hrs
Add job to skip list
2 of 4734 failed
GRECLIPSE › TE42 › #162 1 week ago
Add back timed waiting
Fix for waiting
Reduce build timeout to 2hrs
Add de-duplication of DSLD proposals
Increased timeout
Fix for recent changes
Fix for AssertionFailedException
org.eclipse.core.runtime.AssertionFailedException: assertion failed:
        at org.eclipse.core.runtime.Assert.isTrue(Assert.java:110)
        at org.eclipse.core.runtime.Assert.isTrue(Assert.java:96)
        at
org.eclipse.ltk.core.refactoring.TextChange.setEdit(TextChange.java:103)
        at
org.codehaus.groovy.eclipse.quickassist.GroovyQuickAssistProposal2.toTextChange(GroovyQuickAssistProposal2.java:41)
        at
org.codehaus.groovy.eclipse.quickassist.proposals.ConvertMethodDefToClosureProposal.getTextChange(ConvertMethodDefToClosureProposal.java:55)
        at
org.codehaus.groovy.eclipse.quickassist.GroovyQuickAssistProposal2.getAdditionalProposalInfo(GroovyQuickAssistProposal2.java:49)
        at
org.eclipse.jface.text.contentassist.AdditionalInfoController$Timer$2$1.run(AdditionalInfoController.java:113)
        at org.eclipse.core.internal.jobs.Worker.run(Worker.java:56)
Add job to skip list
Fix for ArrayIndexOutOfBoundsException
java.lang.ArrayIndexOutOfBoundsException: 377
        at
org.codehaus.groovy.eclipse.codebrowsing.fragments.MethodCallFragment.getTrimmedEnd(MethodCallFragment.java:83)
        at
org.codehaus.groovy.eclipse.codebrowsing.fragments.PropertyExpressionFragment.getTrimmedEnd(PropertyExpressionFragment.java:64)
        at
org.codehaus.groovy.eclipse.codebrowsing.fragments.PropertyExpressionFragment.getTrimmedLength(PropertyExpressionFragment.java:68)
        at
org.codehaus.groovy.eclipse.refactoring.core.extract.ExtractGroovyLocalRefactoring.checkInitialConditions(ExtractGroovyLocalRefactoring.java:153)
        at
org.eclipse.ltk.core.refactoring.Refactoring.checkAllConditions(Refactoring.java:158)
        at
org.codehaus.groovy.eclipse.quickassist.proposals.ExtractToLocalProposal.getRelevance(ExtractToLocalProposal.java:65)
        at
org.codehaus.groovy.eclipse.quickassist.GroovyQuickAssist.getAssists(GroovyQuickAssist.java:97)
        at
org.codehaus.groovy.eclipse.quickassist.GroovyQuickAssist.hasAssists(GroovyQuickAssist.java:63)
        at
org.eclipse.jdt.internal.ui.text.correction.JavaCorrectionProcessor$SafeHasAssist.safeRun(JavaCorrectionProcessor.java:435)
        at
org.eclipse.jdt.internal.ui.text.correction.JavaCorrectionProcessor$SafeCorrectionProcessorAccess.run(JavaCorrectionProcessor.java:344)
        at org.eclipse.core.runtime.SafeRunner.run(SafeRunner.java:42)
        at
org.eclipse.jdt.internal.ui.text.correction.JavaCorrectionProcessor$SafeCorrectionProcessorAccess.process(JavaCorrectionProcessor.java:339)
        at
org.eclipse.jdt.internal.ui.text.correction.JavaCorrectionProcessor.hasAssists(JavaCorrectionProcessor.java:154)
        at
org.eclipse.jdt.internal.ui.text.correction.QuickAssistLightBulbUpdater.calculateLightBulb(QuickAssistLightBulbUpdater.java:227)
        at
org.eclipse.jdt.internal.ui.text.correction.QuickAssistLightBulbUpdater.doSelectionChanged(QuickAssistLightBulbUpdater.java:220)
        at
org.eclipse.jdt.internal.ui.text.correction.QuickAssistLightBulbUpdater.access$0(QuickAssistLightBulbUpdater.java:203)
        at
org.eclipse.jdt.internal.ui.text.correction.QuickAssistLightBulbUpdater$1.selectionChanged(QuickAssistLightBulbUpdater.java:128)
Refactor waiting
Prevent waiting on progress dialog
Method does not exist on e44
Change the wait loop
Add wait for background jobs before creating sources or opening editors
Add jobs to skip list
Disable auto-add of classpath container to prevent conflicts
Use simpler createProposalsAtOffset call in most cases
Fix for issue #303: DSL tests should run now
Increase timeout
Add print of waiting
Add job to skip list
1 of 4734 failed
GRECLIPSE › GE46 › #397 1 week ago
Method does not exist on e44
2367 passed
GRECLIPSE › E44TP › #628 1 week ago
Fix for ArrayIndexOutOfBoundsException
java.lang.ArrayIndexOutOfBoundsException: 377
        at
org.codehaus.groovy.eclipse.codebrowsing.fragments.MethodCallFragment.getTrimmedEnd(MethodCallFragment.java:83)
        at
org.codehaus.groovy.eclipse.codebrowsing.fragments.PropertyExpressionFragment.getTrimmedEnd(PropertyExpressionFragment.java:64)
        at
org.codehaus.groovy.eclipse.codebrowsing.fragments.PropertyExpressionFragment.getTrimmedLength(PropertyExpressionFragment.java:68)
        at
org.codehaus.groovy.eclipse.refactoring.core.extract.ExtractGroovyLocalRefactoring.checkInitialConditions(ExtractGroovyLocalRefactoring.java:153)
        at
org.eclipse.ltk.core.refactoring.Refactoring.checkAllConditions(Refactoring.java:158)
        at
org.codehaus.groovy.eclipse.quickassist.proposals.ExtractToLocalProposal.getRelevance(ExtractToLocalProposal.java:65)
        at
org.codehaus.groovy.eclipse.quickassist.GroovyQuickAssist.getAssists(GroovyQuickAssist.java:97)
        at
org.codehaus.groovy.eclipse.quickassist.GroovyQuickAssist.hasAssists(GroovyQuickAssist.java:63)
        at
org.eclipse.jdt.internal.ui.text.correction.JavaCorrectionProcessor$SafeHasAssist.safeRun(JavaCorrectionProcessor.java:435)
        at
org.eclipse.jdt.internal.ui.text.correction.JavaCorrectionProcessor$SafeCorrectionProcessorAccess.run(JavaCorrectionProcessor.java:344)
        at org.eclipse.core.runtime.SafeRunner.run(SafeRunner.java:42)
        at
org.eclipse.jdt.internal.ui.text.correction.JavaCorrectionProcessor$SafeCorrectionProcessorAccess.process(JavaCorrectionProcessor.java:339)
        at
org.eclipse.jdt.internal.ui.text.correction.JavaCorrectionProcessor.hasAssists(JavaCorrectionProcessor.java:154)
        at
org.eclipse.jdt.internal.ui.text.correction.QuickAssistLightBulbUpdater.calculateLightBulb(QuickAssistLightBulbUpdater.java:227)
        at
org.eclipse.jdt.internal.ui.text.correction.QuickAssistLightBulbUpdater.doSelectionChanged(QuickAssistLightBulbUpdater.java:220)
        at
org.eclipse.jdt.internal.ui.text.correction.QuickAssistLightBulbUpdater.access$0(QuickAssistLightBulbUpdater.java:203)
        at
org.eclipse.jdt.internal.ui.text.correction.QuickAssistLightBulbUpdater$1.selectionChanged(QuickAssistLightBulbUpdater.java:128)
Add de-duplication of DSLD proposals
Add back timed waiting
Reduce build timeout to 2hrs
Fix for issue #303: DSL tests should run now
Fix for AssertionFailedException
org.eclipse.core.runtime.AssertionFailedException: assertion failed:
        at org.eclipse.core.runtime.Assert.isTrue(Assert.java:110)
        at org.eclipse.core.runtime.Assert.isTrue(Assert.java:96)
        at
org.eclipse.ltk.core.refactoring.TextChange.setEdit(TextChange.java:103)
        at
org.codehaus.groovy.eclipse.quickassist.GroovyQuickAssistProposal2.toTextChange(GroovyQuickAssistProposal2.java:41)
        at
org.codehaus.groovy.eclipse.quickassist.proposals.ConvertMethodDefToClosureProposal.getTextChange(ConvertMethodDefToClosureProposal.java:55)
        at
org.codehaus.groovy.eclipse.quickassist.GroovyQuickAssistProposal2.getAdditionalProposalInfo(GroovyQuickAssistProposal2.java:49)
        at
org.eclipse.jface.text.contentassist.AdditionalInfoController$Timer$2$1.run(AdditionalInfoController.java:113)
        at org.eclipse.core.internal.jobs.Worker.run(Worker.java:56)
Add print of waiting
Increase timeout
Add jobs to skip list
Refactor waiting
Prevent waiting on progress dialog
Change the wait loop
Fix for recent changes
Use simpler createProposalsAtOffset call in most cases
Increased timeout
Disable auto-add of classpath container to prevent conflicts
Fix for waiting
Add wait for background jobs before creating sources or opening editors
Testless build
GRECLIPSE › GE47 › #222 1 week ago
Add back timed waiting
1 of 5229 failed
GRECLIPSE › GE47 › #213 2 weeks ago
Change the wait loop
2366 passed
Build Completed Code commits Tests
GRECLIPSE › E37BTP › #81 3 days ago
Exclude synthetic proposals like compareTo(Object) for Comparable<T>
4562 passed
GRECLIPSE › TE43 › #345 4 days ago
Fix for issue #313: correct misspellings
4562 passed
GRECLIPSE › GE47 › #230 4 days ago
Fix for issue #313: correct misspellings
5037 passed
GRECLIPSE › GE46 › #402 1 week ago
Build trigger
5037 passed
GRECLIPSE › TE42 › #163 1 week ago
Try wildcards
4562 passed
GRECLIPSE › E44TP › #629 1 week ago
Add job to skip list
Method does not exist on e44
Add job to skip list
4569 passed
GRECLIPSE › GE46 › #399 1 week ago
Add job to skip list
5037 passed
GRECLIPSE › GE47 › #224 1 week ago
Method does not exist on e44
5037 passed
GRECLIPSE › GE46 › #396 1 week ago
Add jobs to skip list
5037 passed
GRECLIPSE › GE47 › #221 1 week ago
Fix for recent changes
5037 passed