AJDT tycho 4.6 build - main repo

Build: #2 failed Manual run by Andy Clement

Build result summary

Details

Completed
Duration
122 minutes
Labels
None
Agent
bamboo-13.af.pivotal.io
Revision
7a04215ad722cc875298aecfe8b771af9d261d97 7a04215ad722cc875298aecfe8b771af9d261d97
Total tests
1104

Responsible

No one has taken responsibility for this failure

Tests

New test failures 9
Status Test View job Duration
Collapse Failed Bug273770Tests testExtraAspectpathEntry2 History
Build Job 1 sec
java.lang.IllegalStateException: Unable to find 'org.eclipse.jdt.apt.core' in the string ''
	at java.lang.String.substring(String.java:1960)
	at org.eclipse.ajdt.core.tests.ajde.Bug273770Tests.findValue(Bug273770Tests.java:81)
	at org.eclipse.ajdt.core.tests.ajde.Bug273770Tests.testExtraAspectpathEntry2(Bug273770Tests.java:60)
Collapse Failed Bug273770Tests testExtraInpathEntry2 History
Build Job 2 secs
java.lang.IllegalStateException: Unable to find 'org.eclipse.jdt_' in the string ''
	at java.lang.String.substring(String.java:1960)
	at org.eclipse.ajdt.core.tests.ajde.Bug273770Tests.findValue(Bug273770Tests.java:81)
	at org.eclipse.ajdt.core.tests.ajde.Bug273770Tests.testExtraInpathEntry2(Bug273770Tests.java:73)
Collapse Failed InpathOutFolderTest2 testJarOnInpath History
Build Job 4 secs
junit.framework.AssertionFailedError: AspectJ RT should exist in the in path out folder
	at junit.framework.Assert.fail(Assert.java:57)
	at junit.framework.TestCase.fail(TestCase.java:227)
	at org.eclipse.ajdt.ui.tests.builder.InpathOutFolderTest2.testJarOnInpath_aroundBody0(InpathOutFolderTest2.java:63)
	at org.eclipse.ajdt.ui.tests.builder.InpathOutFolderTest2.testJarOnInpath_aroundBody1$advice(InpathOutFolderTest2.java:52)
	at org.eclipse.ajdt.ui.tests.builder.InpathOutFolderTest2.testJarOnInpath(InpathOutFolderTest2.java:1)
Collapse Failed AspectJEditorTest testOpenAJFile History
Build Job 2 secs
junit.framework.AssertionFailedError: The test added errors to the log:
FrameworkEvent ERROR
org.osgi.framework.BundleException: Could not resolve module: org.eclipse.jdt.launching.macosx [220]
  Unresolved requirement: Require-Capability: eclipse.platform; filter:="(osgi.os=macosx)"

 at org.eclipse.osgi.container.Module.start(Module.java:444)
 at org.eclipse.osgi.container.ModuleContainer$ContainerStartLevel.incStartLevel(ModuleContainer.java:1620)
 at org.eclipse.osgi.container.ModuleContainer$ContainerStartLevel.incStartLevel(ModuleContainer.java:1599)
(58 more lines...)
Collapse Failed XReferenceAdapterFactoryTest testGetAdapter History
Build Job < 1 sec
junit.framework.AssertionFailedError: null
	at junit.framework.Assert.fail(Assert.java:55)
	at junit.framework.Assert.assertTrue(Assert.java:22)
	at junit.framework.Assert.assertNotNull(Assert.java:256)
	at junit.framework.Assert.assertNotNull(Assert.java:248)
	at junit.framework.TestCase.assertNotNull(TestCase.java:417)
	at org.eclipse.contribution.xref.core.tests.XReferenceAdapterFactoryTest.testGetAdapter(XReferenceAdapterFactoryTest.java:50)
Collapse Failed XReferenceAdapterTest testGetXReferences History
Build Job < 1 sec
junit.framework.AssertionFailedError: expected:<1> but was:<0>
	at junit.framework.Assert.fail(Assert.java:57)
	at junit.framework.Assert.failNotEquals(Assert.java:329)
	at junit.framework.Assert.assertEquals(Assert.java:78)
	at junit.framework.Assert.assertEquals(Assert.java:234)
	at junit.framework.Assert.assertEquals(Assert.java:241)
	at junit.framework.TestCase.assertEquals(TestCase.java:409)
	at org.eclipse.contribution.xref.core.tests.XReferenceAdapterTest.testGetXReferences(XReferenceAdapterTest.java:45)
Collapse Failed XReferenceProviderManagerTest testGetProvidersFor History
Build Job < 1 sec
junit.framework.AssertionFailedError: expected:<1> but was:<0>
	at junit.framework.Assert.fail(Assert.java:57)
	at junit.framework.Assert.failNotEquals(Assert.java:329)
	at junit.framework.Assert.assertEquals(Assert.java:78)
	at junit.framework.Assert.assertEquals(Assert.java:234)
	at junit.framework.Assert.assertEquals(Assert.java:241)
	at junit.framework.TestCase.assertEquals(TestCase.java:409)
	at org.eclipse.contribution.xref.core.tests.XReferenceProviderManagerTest.testGetProvidersFor(XReferenceProviderManagerTest.java:58)
Collapse Failed XReferenceProviderManagerTest testGetRegisteredProviders History
Build Job < 1 sec
junit.framework.AssertionFailedError: null
	at junit.framework.Assert.fail(Assert.java:55)
	at junit.framework.Assert.assertTrue(Assert.java:22)
	at junit.framework.Assert.assertTrue(Assert.java:31)
	at junit.framework.TestCase.assertTrue(TestCase.java:201)
	at org.eclipse.contribution.xref.core.tests.XReferenceProviderManagerTest.testGetRegisteredProviders(XReferenceProviderManagerTest.java:73)
Collapse Failed XReferenceViewTest testViewContentProviderLive History
Build Job < 1 sec
junit.framework.AssertionFailedError: expected:<test associate> but was:<AdaptableString [val=test associate]>
	at junit.framework.Assert.fail(Assert.java:57)
	at junit.framework.Assert.failNotEquals(Assert.java:329)
	at junit.framework.Assert.assertEquals(Assert.java:78)
	at junit.framework.Assert.assertEquals(Assert.java:86)
	at junit.framework.TestCase.assertEquals(TestCase.java:253)
	at org.eclipse.contribution.xref.ui.tests.views.XReferenceViewTest.testViewContentProviderLive(XReferenceViewTest.java:205)

Shared artifacts

Artifact File size
update site 14 MB