Build: #11 failed Manual run by Andy Clement

Build result summary

Details

Completed
Duration
140 minutes
Labels
None
Agent
bamboo-12.af.pivotal.io
Revisions
Plan Repository
ec7e65a81154d741162f0be46cc64f41c210c31d ec7e65a81154d741162f0be46cc64f41c210c31d
eclipse
7a04215ad722cc875298aecfe8b771af9d261d97 7a04215ad722cc875298aecfe8b771af9d261d97
Total tests
1104
Failing since
#1 (Manual run by Martin Lippert)

Responsible

This build has been failing since #1
No one has taken responsibility

Tests

Existing test failures 9
Status Test Failing since View job Duration
java.lang.IllegalStateException: Unable to find 'org.eclipse.jdt.apt.core' in the string ''
	at java.lang.String.substring(String.java:1960)
	at org.eclipse.ajdt.core.tests.ajde.Bug273770Tests.findValue(Bug273770Tests.java:81)
	at org.eclipse.ajdt.core.tests.ajde.Bug273770Tests.testExtraAspectpathEntry2(Bug273770Tests.java:60)
java.lang.IllegalStateException: Unable to find 'org.eclipse.jdt_' in the string ''
	at java.lang.String.substring(String.java:1960)
	at org.eclipse.ajdt.core.tests.ajde.Bug273770Tests.findValue(Bug273770Tests.java:81)
	at org.eclipse.ajdt.core.tests.ajde.Bug273770Tests.testExtraInpathEntry2(Bug273770Tests.java:73)
junit.framework.AssertionFailedError: AspectJ RT should exist in the in path out folder
	at junit.framework.Assert.fail(Assert.java:57)
	at junit.framework.TestCase.fail(TestCase.java:227)
	at org.eclipse.ajdt.ui.tests.builder.InpathOutFolderTest2.testJarOnInpath_aroundBody0(InpathOutFolderTest2.java:63)
	at org.eclipse.ajdt.ui.tests.builder.InpathOutFolderTest2.testJarOnInpath_aroundBody1$advice(InpathOutFolderTest2.java:52)
	at org.eclipse.ajdt.ui.tests.builder.InpathOutFolderTest2.testJarOnInpath(InpathOutFolderTest2.java:1)
junit.framework.AssertionFailedError: The test added errors to the log:
FrameworkEvent ERROR
org.osgi.framework.BundleException: Could not resolve module: org.eclipse.jdt.launching.macosx [220]
  Unresolved requirement: Require-Capability: eclipse.platform; filter:="(osgi.os=macosx)"

 at org.eclipse.osgi.container.Module.start(Module.java:444)
 at org.eclipse.osgi.container.ModuleContainer$ContainerStartLevel.incStartLevel(ModuleContainer.java:1620)
 at org.eclipse.osgi.container.ModuleContainer$ContainerStartLevel.incStartLevel(ModuleContainer.java:1599)
(58 more lines...)
junit.framework.AssertionFailedError: null
	at junit.framework.Assert.fail(Assert.java:55)
	at junit.framework.Assert.assertTrue(Assert.java:22)
	at junit.framework.Assert.assertNotNull(Assert.java:256)
	at junit.framework.Assert.assertNotNull(Assert.java:248)
	at junit.framework.TestCase.assertNotNull(TestCase.java:417)
	at org.eclipse.contribution.xref.core.tests.XReferenceAdapterFactoryTest.testGetAdapter(XReferenceAdapterFactoryTest.java:50)
junit.framework.AssertionFailedError: expected:<1> but was:<0>
	at junit.framework.Assert.fail(Assert.java:57)
	at junit.framework.Assert.failNotEquals(Assert.java:329)
	at junit.framework.Assert.assertEquals(Assert.java:78)
	at junit.framework.Assert.assertEquals(Assert.java:234)
	at junit.framework.Assert.assertEquals(Assert.java:241)
	at junit.framework.TestCase.assertEquals(TestCase.java:409)
	at org.eclipse.contribution.xref.core.tests.XReferenceAdapterTest.testGetXReferences(XReferenceAdapterTest.java:45)
junit.framework.AssertionFailedError: expected:<1> but was:<0>
	at junit.framework.Assert.fail(Assert.java:57)
	at junit.framework.Assert.failNotEquals(Assert.java:329)
	at junit.framework.Assert.assertEquals(Assert.java:78)
	at junit.framework.Assert.assertEquals(Assert.java:234)
	at junit.framework.Assert.assertEquals(Assert.java:241)
	at junit.framework.TestCase.assertEquals(TestCase.java:409)
	at org.eclipse.contribution.xref.core.tests.XReferenceProviderManagerTest.testGetProvidersFor(XReferenceProviderManagerTest.java:58)
junit.framework.AssertionFailedError: null
	at junit.framework.Assert.fail(Assert.java:55)
	at junit.framework.Assert.assertTrue(Assert.java:22)
	at junit.framework.Assert.assertTrue(Assert.java:31)
	at junit.framework.TestCase.assertTrue(TestCase.java:201)
	at org.eclipse.contribution.xref.core.tests.XReferenceProviderManagerTest.testGetRegisteredProviders(XReferenceProviderManagerTest.java:73)
junit.framework.AssertionFailedError: expected:<test associate> but was:<AdaptableString [val=test associate]>
	at junit.framework.Assert.fail(Assert.java:57)
	at junit.framework.Assert.failNotEquals(Assert.java:329)
	at junit.framework.Assert.assertEquals(Assert.java:78)
	at junit.framework.Assert.assertEquals(Assert.java:86)
	at junit.framework.TestCase.assertEquals(TestCase.java:253)
	at org.eclipse.contribution.xref.ui.tests.views.XReferenceViewTest.testViewContentProviderLive(XReferenceViewTest.java:205)
Fixed tests 8
Status Test Failing since View job Duration
Successful ContentAssistTests4 testInITD History
Failing since build #3 (Manual run by Martin Lippert) Build Job 2 secs
Successful ContentAssistTests5 testGenericContentAssist3 History
Failing since build #3 (Manual run by Martin Lippert) Build Job 3 secs
Successful ITITContentAssistTests testContentAssistInTargetType History
Failing since build #3 (Manual run by Martin Lippert) Build Job 10 secs
Successful ITITContentAssistTests testContentAssistInOtherType History
Failing since build #3 (Manual run by Martin Lippert) Build Job 11 secs
Successful ITDRenameProcessorTests testRenameMethodQualifiedListArg3 History
Failing since build #3 (Manual run by Martin Lippert) Build Job 9 secs
Successful ITDRenameProcessorTests testRenameMethodListOfStringArg3 History
Failing since build #3 (Manual run by Martin Lippert) Build Job 9 secs
Successful PushInRefactoringDeclareParentsTests testSamePackage2 History
Failing since build #3 (Manual run by Martin Lippert) Build Job 9 secs
Successful PushInRefactoringDeclareParentsTests testDefaultPackage7 History
Failing since build #3 (Manual run by Martin Lippert) Build Job 8 secs

Shared artifacts

Artifact File size
update site 14 MB