Build: #11 failed

Job: Build Job failed

Stages & jobs

  1. Default Stage

Open AJfile: Test case result

The below summarizes the result of the test "Open AJfile" in build 11 of org.eclipse.ajdt - AJDT for Eclipse 4.6 (Tycho) - Build Job. View test case history
Description
Open AJfile
Test class
org.eclipse.ajdt.ui.tests.editor.AspectJEditorTest
Method
testOpenAJFile
Duration
2 secs
Status
Failed (Existing Failure)

Error Log

junit.framework.AssertionFailedError: The test added errors to the log:
FrameworkEvent ERROR
org.osgi.framework.BundleException: Could not resolve module: org.eclipse.jdt.launching.macosx [220]
  Unresolved requirement: Require-Capability: eclipse.platform; filter:="(osgi.os=macosx)"

 at org.eclipse.osgi.container.Module.start(Module.java:444)
 at org.eclipse.osgi.container.ModuleContainer$ContainerStartLevel.incStartLevel(ModuleContainer.java:1620)
 at org.eclipse.osgi.container.ModuleContainer$ContainerStartLevel.incStartLevel(ModuleContainer.java:1599)
 at org.eclipse.osgi.container.ModuleContainer$ContainerStartLevel.doContainerStartLevel(ModuleContainer.java:1571)
 at org.eclipse.osgi.container.ModuleContainer$ContainerStartLevel.dispatchEvent(ModuleContainer.java:1514)
 at org.eclipse.osgi.container.ModuleContainer$ContainerStartLevel.dispatchEvent(ModuleContainer.java:1)
 at org.eclipse.osgi.framework.eventmgr.EventManager.dispatchEvent(EventManager.java:230)
 at org.eclipse.osgi.framework.eventmgr.EventManager$EventThread.run(EventManager.java:340)


The test added errors to the log:
FrameworkEvent ERROR
org.osgi.framework.BundleException: Could not resolve module: org.eclipse.jdt.launching.ui.macosx [221]
  Unresolved requirement: Require-Capability: eclipse.platform; filter:="(osgi.os=macosx)"

 at org.eclipse.osgi.container.Module.start(Module.java:444)
 at org.eclipse.osgi.container.ModuleContainer$ContainerStartLevel.incStartLevel(ModuleContainer.java:1620)
 at org.eclipse.osgi.container.ModuleContainer$ContainerStartLevel.incStartLevel(ModuleContainer.java:1599)
 at org.eclipse.osgi.container.ModuleContainer$ContainerStartLevel.doContainerStartLevel(ModuleContainer.java:1571)
 at org.eclipse.osgi.container.ModuleContainer$ContainerStartLevel.dispatchEvent(ModuleContainer.java:1514)
 at org.eclipse.osgi.container.ModuleContainer$ContainerStartLevel.dispatchEvent(ModuleContainer.java:1)
 at org.eclipse.osgi.framework.eventmgr.EventManager.dispatchEvent(EventManager.java:230)
 at org.eclipse.osgi.framework.eventmgr.EventManager$EventThread.run(EventManager.java:340)



junit.framework.AssertionFailedError: The test added errors to the log:
FrameworkEvent ERROR
org.osgi.framework.BundleException: Could not resolve module: org.eclipse.jdt.launching.macosx [220]
  Unresolved requirement: Require-Capability: eclipse.platform; filter:="(osgi.os=macosx)"

	at org.eclipse.osgi.container.Module.start(Module.java:444)
	at org.eclipse.osgi.container.ModuleContainer$ContainerStartLevel.incStartLevel(ModuleContainer.java:1620)
	at org.eclipse.osgi.container.ModuleContainer$ContainerStartLevel.incStartLevel(ModuleContainer.java:1599)
	at org.eclipse.osgi.container.ModuleContainer$ContainerStartLevel.doContainerStartLevel(ModuleContainer.java:1571)
	at org.eclipse.osgi.container.ModuleContainer$ContainerStartLevel.dispatchEvent(ModuleContainer.java:1514)
	at org.eclipse.osgi.container.ModuleContainer$ContainerStartLevel.dispatchEvent(ModuleContainer.java:1)
	at org.eclipse.osgi.framework.eventmgr.EventManager.dispatchEvent(EventManager.java:230)
	at org.eclipse.osgi.framework.eventmgr.EventManager$EventThread.run(EventManager.java:340)


The test added errors to the log:
FrameworkEvent ERROR
org.osgi.framework.BundleException: Could not resolve module: org.eclipse.jdt.launching.ui.macosx [221]
  Unresolved requirement: Require-Capability: eclipse.platform; filter:="(osgi.os=macosx)"

	at org.eclipse.osgi.container.Module.start(Module.java:444)
	at org.eclipse.osgi.container.ModuleContainer$ContainerStartLevel.incStartLevel(ModuleContainer.java:1620)
	at org.eclipse.osgi.container.ModuleContainer$ContainerStartLevel.incStartLevel(ModuleContainer.java:1599)
	at org.eclipse.osgi.container.ModuleContainer$ContainerStartLevel.doContainerStartLevel(ModuleContainer.java:1571)
	at org.eclipse.osgi.container.ModuleContainer$ContainerStartLevel.dispatchEvent(ModuleContainer.java:1514)
	at org.eclipse.osgi.container.ModuleContainer$ContainerStartLevel.dispatchEvent(ModuleContainer.java:1)
	at org.eclipse.osgi.framework.eventmgr.EventManager.dispatchEvent(EventManager.java:230)
	at org.eclipse.osgi.framework.eventmgr.EventManager$EventThread.run(EventManager.java:340)



	at junit.framework.Assert.fail(Assert.java:57)
	at junit.framework.TestCase.fail(TestCase.java:227)
	at org.eclipse.ajdt.ui.tests.editor.AspectJEditorTest.testOpenAJFile_aroundBody1$advice(AspectJEditorTest.java:72)
	at org.eclipse.ajdt.ui.tests.editor.AspectJEditorTest.testOpenAJFile(AspectJEditorTest.java:1)