1.5.x Branch

Logs

The following logs have been generated by the jobs in this plan.
  • Expand all
  • Collapse all
Job Logs
Collapse Default Job Default Stage Download or View
16-Mar-2019 16:47:29 :spring-rabbit:assemble
16-Mar-2019 16:47:29 :spring-rabbit:checkTestConfigs
16-Mar-2019 16:47:30 :spring-rabbit:compileTestJava
16-Mar-2019 16:47:30 :spring-rabbit:processTestResources
16-Mar-2019 16:47:30 :spring-rabbit:testClasses
16-Mar-2019 16:48:54 :spring-rabbit:test
16-Mar-2019 16:48:54
16-Mar-2019 16:48:54 org.springframework.amqp.rabbit.core.RabbitManagementTemplateTests > testDeleteExchange FAILED
16-Mar-2019 16:48:54     org.springframework.web.client.HttpClientErrorException at RabbitManagementTemplateTests.java:207
16-Mar-2019 16:49:34
16-Mar-2019 16:49:34 543 tests completed, 1 failed, 46 skipped
16-Mar-2019 16:49:35 :spring-rabbit:test FAILED
16-Mar-2019 16:49:35
16-Mar-2019 16:49:35 FAILURE: Build failed with an exception.
16-Mar-2019 16:49:35
16-Mar-2019 16:49:35 * What went wrong:
16-Mar-2019 16:49:35 Execution failed for task ':spring-rabbit:test'.
16-Mar-2019 16:49:35 > There were failing tests. See the report at: file:///opt/bamboo-home/xml-data/build-dir/AMQP-B15X-JOB1/spring-rabbit/build/reports/tests/index.html
16-Mar-2019 16:49:35
16-Mar-2019 16:49:35 * Try:
16-Mar-2019 16:49:35 Run with --stacktrace option to get the stack trace. Run with --info or --debug option to get more log output.
16-Mar-2019 16:49:35
16-Mar-2019 16:49:35 BUILD FAILED
16-Mar-2019 16:49:35
16-Mar-2019 16:49:35 Total time: 3 mins 6.234 secs