1.5.x Branch

Logs

The following logs have been generated by the jobs in this plan.
  • Expand all
  • Collapse all
Job Logs
Collapse Default Job Default Stage Download or View
22-Mar-2019 21:26:44 :spring-rabbit:assemble
22-Mar-2019 21:26:44 :spring-rabbit:checkTestConfigs
22-Mar-2019 21:26:45 :spring-rabbit:compileTestJava
22-Mar-2019 21:26:45 :spring-rabbit:processTestResources
22-Mar-2019 21:26:45 :spring-rabbit:testClasses
22-Mar-2019 21:28:04 :spring-rabbit:test
22-Mar-2019 21:28:04
22-Mar-2019 21:28:04 org.springframework.amqp.rabbit.core.RabbitManagementTemplateTests > testDeleteExchange FAILED
22-Mar-2019 21:28:04     org.springframework.web.client.HttpClientErrorException at RabbitManagementTemplateTests.java:207
22-Mar-2019 21:28:42
22-Mar-2019 21:28:42 543 tests completed, 1 failed, 46 skipped
22-Mar-2019 21:28:42 :spring-rabbit:test FAILED
22-Mar-2019 21:28:42
22-Mar-2019 21:28:42 FAILURE: Build failed with an exception.
22-Mar-2019 21:28:42
22-Mar-2019 21:28:42 * What went wrong:
22-Mar-2019 21:28:42 Execution failed for task ':spring-rabbit:test'.
22-Mar-2019 21:28:42 > There were failing tests. See the report at: file:///opt/bamboo-home/xml-data/build-dir/AMQP-B15X-JOB1/spring-rabbit/build/reports/tests/index.html
22-Mar-2019 21:28:42
22-Mar-2019 21:28:42 * Try:
22-Mar-2019 21:28:42 Run with --stacktrace option to get the stack trace. Run with --info or --debug option to get more log output.
22-Mar-2019 21:28:42
22-Mar-2019 21:28:42 BUILD FAILED
22-Mar-2019 21:28:42
22-Mar-2019 21:28:42 Total time: 3 mins 10.365 secs