1.5.x Branch

Logs

The following logs have been generated by the jobs in this plan.
  • Expand all
  • Collapse all
Job Logs
Collapse Default Job Default Stage Download or View
26-Mar-2019 16:53:38 :spring-rabbit:assemble
26-Mar-2019 16:53:38 :spring-rabbit:checkTestConfigs
26-Mar-2019 16:53:40 :spring-rabbit:compileTestJava
26-Mar-2019 16:53:40 :spring-rabbit:processTestResources
26-Mar-2019 16:53:40 :spring-rabbit:testClasses
26-Mar-2019 16:55:11 :spring-rabbit:test
26-Mar-2019 16:55:11
26-Mar-2019 16:55:11 org.springframework.amqp.rabbit.core.RabbitManagementTemplateTests > testDeleteExchange FAILED
26-Mar-2019 16:55:11     org.springframework.web.client.HttpClientErrorException at RabbitManagementTemplateTests.java:207
26-Mar-2019 16:55:51
26-Mar-2019 16:55:51 543 tests completed, 1 failed, 46 skipped
26-Mar-2019 16:55:51 :spring-rabbit:test FAILED
26-Mar-2019 16:55:51
26-Mar-2019 16:55:51 FAILURE: Build failed with an exception.
26-Mar-2019 16:55:51
26-Mar-2019 16:55:51 * What went wrong:
26-Mar-2019 16:55:51 Execution failed for task ':spring-rabbit:test'.
26-Mar-2019 16:55:51 > There were failing tests. See the report at: file:///opt/bamboo-home/xml-data/build-dir/AMQP-B15X-JOB1/spring-rabbit/build/reports/tests/index.html
26-Mar-2019 16:55:51
26-Mar-2019 16:55:51 * Try:
26-Mar-2019 16:55:51 Run with --stacktrace option to get the stack trace. Run with --info or --debug option to get more log output.
26-Mar-2019 16:55:51
26-Mar-2019 16:55:51 BUILD FAILED
26-Mar-2019 16:55:51
26-Mar-2019 16:55:51 Total time: 3 mins 17.562 secs