1.5.x Branch

Build result summary

Details

Completed
Duration
3 minutes
Labels
None
Revision
dec8dbf42533ea445e56b9c3d0fd3c94760e0b10 dec8dbf42533ea445e56b9c3d0fd3c94760e0b10
Total tests
682
Failing since
#39 (Changes by Spring Operator <spring-operator@users.noreply.github.com>)

Tests

Responsible

This build has been failing since #39
No one has taken responsibility

Code commits

Author Commit Message Commit date
Spring Operator <spring-operator@users.noreply.github.com> Spring Operator <spring-operator@users.noreply.github.com> dec8dbf42533ea445e56b9c3d0fd3c94760e0b10 dec8dbf42533ea445e56b9c3d0fd3c94760e0b10 URL Cleanup
- Ensure Gradle Wrapper is downloaded via https

Tests

Existing test failures 1
Status Test Failing since View job Duration
org.springframework.web.client.HttpClientErrorException: org.springframework.web.client.HttpClientErrorException: 415 Unsupported Media Type
org.springframework.web.client.HttpClientErrorException: 415 Unsupported Media Type
	at org.springframework.web.client.DefaultResponseErrorHandler.handleError(DefaultResponseErrorHandler.java:91)
	at org.springframework.web.client.RestTemplate.handleResponse(RestTemplate.java:641)
	at org.springframework.web.client.RestTemplate.doExecute(RestTemplate.java:597)
	at org.springframework.web.client.RestTemplate.execute(RestTemplate.java:572)
	at org.springframework.web.client.RestTemplate.put(RestTemplate.java:421)
	at com.rabbitmq.http.client.Client.declareExchange(Client.java:261)
(47 more lines...)