1.5.x Branch

Logs

The following logs have been generated by the jobs in this plan.
  • Expand all
  • Collapse all
Job Logs
Collapse Default Job Default Stage Download or View
28-Mar-2019 11:26:26 :spring-rabbit:assemble
28-Mar-2019 11:26:26 :spring-rabbit:checkTestConfigs
28-Mar-2019 11:26:27 :spring-rabbit:compileTestJava
28-Mar-2019 11:26:27 :spring-rabbit:processTestResources
28-Mar-2019 11:26:27 :spring-rabbit:testClasses
28-Mar-2019 11:27:53 :spring-rabbit:test
28-Mar-2019 11:27:53
28-Mar-2019 11:27:53 org.springframework.amqp.rabbit.core.RabbitManagementTemplateTests > testDeleteExchange FAILED
28-Mar-2019 11:27:53     org.springframework.web.client.HttpClientErrorException at RabbitManagementTemplateTests.java:207
28-Mar-2019 11:28:35
28-Mar-2019 11:28:35 543 tests completed, 1 failed, 46 skipped
28-Mar-2019 11:28:35 :spring-rabbit:test FAILED
28-Mar-2019 11:28:35
28-Mar-2019 11:28:35 FAILURE: Build failed with an exception.
28-Mar-2019 11:28:35
28-Mar-2019 11:28:35 * What went wrong:
28-Mar-2019 11:28:35 Execution failed for task ':spring-rabbit:test'.
28-Mar-2019 11:28:35 > There were failing tests. See the report at: file:///opt/bamboo-home/xml-data/build-dir/AMQP-B15X-JOB1/spring-rabbit/build/reports/tests/index.html
28-Mar-2019 11:28:35
28-Mar-2019 11:28:35 * Try:
28-Mar-2019 11:28:35 Run with --stacktrace option to get the stack trace. Run with --info or --debug option to get more log output.
28-Mar-2019 11:28:35
28-Mar-2019 11:28:35 BUILD FAILED
28-Mar-2019 11:28:35
28-Mar-2019 11:28:35 Total time: 3 mins 11.533 secs