1.5.x Branch

Build: #39 failed

Job: Default Job failed

Stages & jobs

  1. Default Stage

Job result summary

Completed
Duration
3 minutes
Revision
c720fab80b69b704e5988523b935761a92c8685f c720fab80b69b704e5988523b935761a92c8685f
Total tests
682

Tests

  • 682 tests in total
  • 1 test failed
  • 1 failure is new
  • 46 tests were quarantined / skipped
  • 1 minute taken in total.
New test failures 1
Status Test Duration
Collapse Failed RabbitManagementTemplateTests testDeleteExchange History
< 1 sec
org.springframework.web.client.HttpClientErrorException: org.springframework.web.client.HttpClientErrorException: 415 Unsupported Media Type
org.springframework.web.client.HttpClientErrorException: 415 Unsupported Media Type
	at org.springframework.web.client.DefaultResponseErrorHandler.handleError(DefaultResponseErrorHandler.java:91)
	at org.springframework.web.client.RestTemplate.handleResponse(RestTemplate.java:641)
	at org.springframework.web.client.RestTemplate.doExecute(RestTemplate.java:597)
	at org.springframework.web.client.RestTemplate.execute(RestTemplate.java:572)
	at org.springframework.web.client.RestTemplate.put(RestTemplate.java:421)
	at com.rabbitmq.http.client.Client.declareExchange(Client.java:261)
(47 more lines...)

Error summary

The build generated some errors. See the full build log for more details.

POM relocation to an other version number is not fully supported in Gradle : xml-apis#xml-apis;2.0.2 relocated to xml-apis#xml-apis;1.0.b2.

543 tests completed, 1 failed, 46 skipped

FAILURE: Build failed with an exception.

* What went wrong:
Execution failed for task ':spring-rabbit:test'.
> There were failing tests. See the report at: file:///opt/bamboo-home/xml-data/build-dir/AMQP-B15X-JOB1/spring-rabbit/build/reports/tests/index.html

* Try:
Run with --stacktrace option to get the stack trace. Run with --info or --debug option to get more log output.