1.5.x Branch

Build: #40 failed

Job: Default Job failed

Stages & jobs

  1. Default Stage

Build log

The build generated 183 lines of output. Download or view full build log

22-Mar-2019 21:25:23 Build Spring AMQP - 1.5.x - Default Job #40 (AMQP-B15X-JOB1-40) started building on agent bamboo-06.af.pivotal.io
22-Mar-2019 21:25:23 Remote agent on host bamboo-06.af.pivotal.io
22-Mar-2019 21:25:23 Build working directory is /opt/bamboo-home/xml-data/build-dir/AMQP-B15X-JOB1
22-Mar-2019 21:25:23 Executing build Spring AMQP - 1.5.x - Default Job #40 (AMQP-B15X-JOB1-40)
22-Mar-2019 21:25:23 Starting task 'Checkout Default Repository' of type 'com.atlassian.bamboo.plugins.vcs:task.vcs.checkout'
22-Mar-2019 21:25:23 Build always requires a clean checkout
22-Mar-2019 21:25:23 Cleaning build directory '/opt/bamboo-home/xml-data/build-dir/AMQP-B15X-JOB1'
22-Mar-2019 21:25:23 Checking out into /opt/bamboo-home/xml-data/build-dir/AMQP-B15X-JOB1
22-Mar-2019 21:25:23 Updating source code to revision: c723575d8f75fddd4e12b05e11ba912141cedea8
22-Mar-2019 21:25:23 Creating local git repository in '/opt/bamboo-home/xml-data/build-dir/AMQP-B15X-JOB1/.git'.
22-Mar-2019 21:25:23 Initialized empty Git repository in /opt/bamboo-home/xml-data/build-dir/AMQP-B15X-JOB1/.git/
22-Mar-2019 21:25:24 Fetching 'refs/heads/1.5.x' from 'https://github.com/spring-projects/spring-amqp.git'.
22-Mar-2019 21:25:32 From https://github.com/spring-projects/spring-amqp
22-Mar-2019 21:25:32 * [new branch]      1.5.x      -> 1.5.x
22-Mar-2019 21:25:32 * [new tag]         1.0.0.M1   -> 1.0.0.M1
22-Mar-2019 21:25:32 * [new tag]         1.0.0.M2   -> 1.0.0.M2
22-Mar-2019 21:25:32 * [new tag]         1.1.0.RELEASE -> 1.1.0.RELEASE
22-Mar-2019 21:25:32 * [new tag]         1.1.1.RELEASE -> 1.1.1.RELEASE
22-Mar-2019 21:25:32 * [new tag]         1.5.6.RELEASE -> 1.5.6.RELEASE
22-Mar-2019 21:25:32 * [new tag]         v1.2.0.RC1 -> v1.2.0.RC1
22-Mar-2019 21:25:32 * [new tag]         v1.2.0.RELEASE -> v1.2.0.RELEASE
22-Mar-2019 21:25:32 * [new tag]         v1.2.0a.M1 -> v1.2.0a.M1
22-Mar-2019 21:25:32 * [new tag]         v1.3.0.M1  -> v1.3.0.M1
22-Mar-2019 21:25:32 * [new tag]         v1.3.0.M2  -> v1.3.0.M2
22-Mar-2019 21:25:32 * [new tag]         v1.3.0.RC1 -> v1.3.0.RC1
22-Mar-2019 21:25:32 * [new tag]         v1.3.0.RELEASE -> v1.3.0.RELEASE
22-Mar-2019 21:25:32 * [new tag]         v1.3.1.RELEASE -> v1.3.1.RELEASE
22-Mar-2019 21:25:32 * [new tag]         v1.3.2.RELEASE -> v1.3.2.RELEASE
22-Mar-2019 21:25:32 * [new tag]         v1.3.3.RELEASE -> v1.3.3.RELEASE
22-Mar-2019 21:25:32 * [new tag]         v1.3.4.RELEASE -> v1.3.4.RELEASE
22-Mar-2019 21:25:32 * [new tag]         v1.4.0.M1  -> v1.4.0.M1
22-Mar-2019 21:25:32 * [new tag]         v1.4.0.RC1 -> v1.4.0.RC1
22-Mar-2019 21:25:32 * [new tag]         v1.4.0.RELEASE -> v1.4.0.RELEASE
22-Mar-2019 21:25:32 * [new tag]         v1.4.1.RELEASE -> v1.4.1.RELEASE
22-Mar-2019 21:25:32 * [new tag]         v1.4.2.M1  -> v1.4.2.M1
22-Mar-2019 21:25:32 * [new tag]         v1.4.2.M2  -> v1.4.2.M2
22-Mar-2019 21:25:32 * [new tag]         v1.4.2.RELEASE -> v1.4.2.RELEASE
22-Mar-2019 21:25:32 * [new tag]         v1.5.0.M1  -> v1.5.0.M1
22-Mar-2019 21:25:32 * [new tag]         v1.5.0.RC1 -> v1.5.0.RC1
22-Mar-2019 21:25:32 * [new tag]         v1.5.0.RELEASE -> v1.5.0.RELEASE
22-Mar-2019 21:25:32 * [new tag]         v1.5.1.RELEASE -> v1.5.1.RELEASE
22-Mar-2019 21:25:32 * [new tag]         v1.5.2.RELEASE -> v1.5.2.RELEASE
22-Mar-2019 21:25:32 * [new tag]         v1.5.3.RELEASE -> v1.5.3.RELEASE
22-Mar-2019 21:25:32 * [new tag]         v1.5.4.RELEASE -> v1.5.4.RELEASE
22-Mar-2019 21:25:32 * [new tag]         v1.5.5.RELEASE -> v1.5.5.RELEASE
22-Mar-2019 21:25:32 * [new tag]         v1.5.7.RELEASE -> v1.5.7.RELEASE
22-Mar-2019 21:25:32 Checking out revision c723575d8f75fddd4e12b05e11ba912141cedea8.
22-Mar-2019 21:25:32 Switched to branch '1.5.x'
22-Mar-2019 21:25:32 Updated source code to revision: c723575d8f75fddd4e12b05e11ba912141cedea8
22-Mar-2019 21:25:32 Finished task 'Checkout Default Repository' with result: Success
22-Mar-2019 21:25:32 Running pre-build action: Artifactory Release Staging
22-Mar-2019 21:25:32 Running pre-build action: VCS Version Collector
22-Mar-2019 21:25:32 Starting task 'Artifactory Gradle' of type 'org.jfrog.bamboo.bamboo-artifactory-plugin:artifactoryGradleTask'
22-Mar-2019 21:25:32 Bamboo Artifactory Plugin version: 2.5.x-SNAPSHOT
22-Mar-2019 21:25:32
Beginning to execute external process for build 'Spring AMQP - 1.5.x - Default Job #40 (AMQP-B15X-JOB1-40)'
... running command line:
./gradlew clean build dist -I /tmp/artifactory.init.script8200430474983689027gradle -DbuildInfoConfig.propertiesFile=/tmp/buildinfo4863440707472109760properties artifactoryPublish -Dartifactory.resolve.password=******** -Dartifactory.publish.password=********
... in: /opt/bamboo-home/xml-data/build-dir/AMQP-B15X-JOB1
... using extra environment variables:
bamboo_planRepository_1_branch=1.5.x
IRBRC=/home/bamboo/.rvm/rubies/ruby-2.3.0/.irbrc
bamboo_********_username_password=********
bamboo_signing_store_password=********
bamboo_capability_system_builder_ant_Ant_1_9=/opt/ant-1.9
bamboo_capability_system_builder_ant_Ant_1_8=/opt/ant-1.8
bamboo_planRepository_1_branchDisplayName=1.5.x
bamboo_capability_system_jdk_OpenJDK_7u181=/opt/openjdk-7
bamboo_repository_revision_number=c723575d8f75fddd4e12b05e11ba912141cedea8
bamboo_capability_system_builder_node_Node_js_6=/usr/bin/node
bamboo_RIAK_BIN=/usr/sbin/riak
WRAPPER_BITS=32
bamboo_buildKey=AMQP-B15X-JOB1
rvm_loaded_flag=1
bamboo_bintray_password=********
bamboo_sonar_token_password=********
rvm_version=1.27.0 (latest)
PWD=/opt/bamboo-home/bin
bamboo_shortJobName=Default Job
bamboo_capability_system_builder_gradle___gradlew=./gradlew
bamboo_buildResultsUrl=https://build.spring.io/browse/AMQP-B15X-JOB1-40
bamboo_capability_system_builder_mvn3_Maven_3_3=/opt/maven-3.3
bamboo_capability_system_builder_mvn3_Maven_3_2=/opt/maven-3.2
bamboo_capability_system_builder_mvn3_Maven_3_1=/opt/maven-3.1
bamboo_planRepository_repositoryUrl=https://github.com/spring-projects/spring-amqp.git
bamboo_agentId=208568327
bamboo_capability_system_builder_mvn3_Maven_3_5=/opt/maven-3.5
MY_RUBY_HOME=/home/bamboo/.rvm/rubies/ruby-2.3.0
bamboo_capability_system_builder_mvn3_Maven_3_0=/opt/maven-3.0
rvm_path=/home/bamboo/.rvm
bamboo_planRepository_revision=c723575d8f75fddd4e12b05e11ba912141cedea8
bamboo_planRepository_previousRevision=c720fab80b69b704e5988523b935761a92c8685f
bamboo_capability_remote_build=true
bamboo_repository_branch_name=1.5.x
bamboo_sonatype_token_password=********
SHLVL=1
bamboo_org_jfrog_bamboo_buildInfo_serverUrl=https://repo.spring.io
bamboo_scdf_acceptance_tests_password=********
WRAPPER_OS=linux
JAVA_HOME=/opt/jdk-8/
EC2_HOME=/opt/ec2-api-tools
XDG_SESSION_ID=c1
bamboo_capability_Agent=bamboo-06.af.pivotal.io
bamboo_planRepository_branch=1.5.x
bamboo_org_jfrog_bamboo_release_activated=false
bamboo_planRepository_1_type=gitv2
bamboo_planRepository_branchName=1.5.x
WRAPPER_FILE_SEPARATOR=/
_=/opt/bamboo-home/bin/bamboo-agent.sh
WRAPPER_PATH_SEPARATOR=:
bamboo_sonar_password=********
bamboo_hg_cache_directory=/opt/bamboo-home/xml-data/build-dir/_hg-repositories-cache
bamboo_planRepository_1_username=spring-buildmaster
bamboo_planRepository_type=gitv2
bamboo_git_cache_directory=/opt/bamboo-home/xml-data/build-dir/_git-repositories-cache
bamboo_artifactory_username=buildmaster
rvm_stored_umask=0002
bamboo_tmp_directory=/opt/bamboo-home/temp
GEM_PATH=/home/bamboo/.rvm/gems/ruby-2.3.0:/home/bamboo/.rvm/gems/ruby-2.3.0@global
bamboo_planKey=AMQP-B15X
bamboo_planRepository_username=spring-buildmaster
bamboo_JDK8_HOME=/opt/jdk-8
NLSPATH=/usr/dt/lib/nls/msg/%L/%N.cat
bamboo_planRepository_1_branchName=1.5.x
bamboo_sonar_version=5.6.3
GRADLE_OPTS= -Xms128m -Xmx1024m
XDG_DATA_DIRS=/usr/local/share:/usr/share:/var/lib/snapd/desktop
bamboo_capability_system_jdk_JDK_1_11=/opt/jdk-11
bamboo_resultsUrl=https://build.spring.io/browse/AMQP-B15X-JOB1-40
bamboo_capability_system_jdk_JDK_1_10=/opt/jdk-10
bamboo_build_working_directory=/opt/bamboo-home/xml-data/build-dir/AMQP-B15X-JOB1
bamboo_planRepository_1_name=Plan Repository
bamboo_capability_system_os=ubuntu1604
bamboo_nexusPush_stagingProfile=buildmaster
bamboo_shortPlanName=1.5.x
MAIL=/var/mail/bamboo
bamboo_planRepository_name=Plan Repository
LOGNAME=bamboo
bamboo_buildNumber=40
rvm_user_install_flag=1
SHELL=/bin/bash
bamboo_repository_193953800_previous_revision_number=c720fab80b69b704e5988523b935761a92c8685f
bamboo_planName=Spring AMQP - 1.5.x
bamboo_JDK7_HOME=/opt/jdk-7
bamboo_shortPlanKey=B15X
OLDPWD=/opt/users/bamboo
GEM_HOME=/home/bamboo/.rvm/gems/ruby-2.3.0
bamboo_shortJobKey=JOB1
bamboo_artifactory_password=********
bamboo_buildTimeStamp=2019-03-22T21:25:22.983Z
bamboo_repository_previous_revision_number=c720fab80b69b704e5988523b935761a92c8685f
RUBY_VERSION=ruby-2.3.0
bamboo_sonar_username=buildmaster
_system_name=Ubuntu
bamboo_********_password=********
bamboo_repository_git_branch=1.5.x
bamboo_buildResultKey=AMQP-B15X-JOB1-40
bamboo_repository_193953800_git_username=spring-buildmaster
bamboo_nexusPush_close=true
bamboo_buildPlanName=Spring AMQP - 1.5.x - Default Job
bamboo_repository_193953800_revision_number=c723575d8f75fddd4e12b05e11ba912141cedea8
bamboo_planRepository_1_revision=c723575d8f75fddd4e12b05e11ba912141cedea8
_system_arch=x86_64
bamboo_repository_name=Plan Repository
rvm_bin_path=/home/bamboo/.rvm/bin
bamboo_signing_key_password=********
XFILESEARCHPATH=/usr/dt/app-defaults/%L/Dt
rvm_prefix=/home/bamboo
LANG=en_US.UTF-8
bamboo_buildFailed=false
bamboo_repository_193953800_git_branch=1.5.x
bamboo_capability_system_docker_executable=/usr/bin/docker
DISPLAY=localhost:1.0
bamboo_capability_system_builder_groovy_Groovy_2_4=/opt/groovy-2.4
bamboo_artifactory_password_mask_b=********
bamboo_capability_system_builder_command_Bash=/bin/bash
bamboo_artifactory_password_mask_a=********
bamboo_agentWorkingDirectory=/opt/bamboo-home/xml-data/build-dir
bamboo_capability_system_git_executable=/usr/bin/git
bamboo_repository_git_username=spring-buildmaster
bamboo_planRepository_1_previousRevision=c720fab80b69b704e5988523b935761a92c8685f
bamboo_capability_os_family=unix
NVM_NODEJS_ORG_MIRROR=http://nodejs.org/dist
bamboo_planRepository_branchDisplayName=1.5.x
NODE_PATH=/usr/lib/nodejs:/usr/lib/node_modules:/usr/share/javascript
bamboo_capability_system_builder_maven_Artifactory_Maven_3_5=/opt/maven-3.5
GIT_SSL_NO_VERIFY=true
bamboo_capability_system_builder_maven_Artifactory_Maven_3_3=/opt/maven-3.3
NVM_DIR=/home/bamboo/.nvm
bamboo_capability_system_builder_maven_Artifactory_Maven_3_2=/opt/maven-3.2
bamboo_s3_properties=/home/bamboo/tools/s3.properties
bamboo_capability_system_builder_maven_Artifactory_Maven_3_1=/opt/maven-3.1
bamboo_capability_system_builder_maven_Artifactory_Maven_3_0=/opt/maven-3.0
_system_type=Linux
bamboo_plan_storageTag=AMQP-B15X
bamboo_bintray_username_password=********
_system_version=16.04
USER=bamboo
bamboo_repository_git_repositoryUrl=https://github.com/spring-projects/spring-amqp.git
bamboo_repository_193953800_branch_name=1.5.x
bamboo_repository_193953800_git_repositoryUrl=https://github.com/spring-projects/spring-amqp.git
bamboo_working_directory=/opt/bamboo-home/xml-data/build-dir/AMQP-B15X-JOB1
bamboo_org_jfrog_bamboo_buildInfo_activated=true
bamboo_repository_193953800_name=Plan Repository
bamboo_planRepository_1_repositoryUrl=https://github.com/spring-projects/spring-amqp.git
bamboo_capability_system_jdk_JDK_1_8=/opt/jdk-8
bamboo_capability_system_jdk_JDK_1_9=/opt/jdk-9
WRAPPER_ARCH=x86
bamboo_capability_system_jdk_JDK_1_6=/opt/jdk-6
bamboo_sonatype_password=********
bamboo_capability_system_jdk_JDK_1_7=/opt/jdk-7
bamboo_sonar_ip=10.194.6.9
XDG_RUNTIME_DIR=/run/user/505
HOME=/home/bamboo
PATH=/bin:/home/bamboo/.rvm/gems/ruby-2.3.0/bin:/home/bamboo/.rvm/gems/ruby-2.3.0@global/bin:/home/bamboo/.rvm/rubies/ruby-2.3.0/bin:/home/bamboo/bin:/usr/local/bin:/usr/bin:/bin:/usr/local/games:/usr/games:/snap/bin:/home/bamboo/bin:/usr/local/bin:/opt/ec2-api-tools/bin:/home/bamboo/.rvm/bin:/bin:/home/bamboo/.rvm/gems/ruby-2.3.0/bin:/home/bamboo/.rvm/gems/ruby-2.3.0@global/bin:/home/bamboo/.rvm/rubies/ruby-2.3.0/bin:/home/bamboo/bin:/usr/local/bin:/usr/bin:/bin:/usr/local/games:/usr/games:/snap/bin:/home/bamboo/bin:/usr/local/bin:/opt/ec2-api-tools/bin:/home/bamboo/.rvm/bin
22-Mar-2019 21:25:32 Downloading http://services.gradle.org/distributions/gradle-2.5-all.zip
22-Mar-2019 21:25:34 ...................................................................................................................................................................................................................................................................................................................................................................................................................................................................................................................................................................................................................................................................................................................................................................................................................................................................................................................................................................................................................................................................................................................................................................................................................................................................................................................................................................................................................................................................................................................................................................................................................................................................................................................................................................................................................................................................................................................................................................................................................................................................................................................................................................................................................................................................................................................................................................................................................................................................................................................................................................................................................................................................................................................................................................................................................................................................................................................................................................................................................................................................................................................................................................................................................................................................................................................................................................................
22-Mar-2019 21:25:34 Unzipping /home/bamboo/.gradle/wrapper/dists/gradle-2.5-all/85d8dd968smc2gj7co7qe6akc/gradle-2.5-all.zip to /home/bamboo/.gradle/wrapper/dists/gradle-2.5-all/85d8dd968smc2gj7co7qe6akc
22-Mar-2019 21:25:35 Set executable permissions for: /home/bamboo/.gradle/wrapper/dists/gradle-2.5-all/85d8dd968smc2gj7co7qe6akc/gradle-2.5/bin/gradle
22-Mar-2019 21:25:39 Download https://repo.spring.io/plugins-release/org/asciidoctor/asciidoctor-gradle-plugin/1.5.0/asciidoctor-gradle-plugin-1.5.0.pom
22-Mar-2019 21:25:43 POM relocation to an other version number is not fully supported in Gradle : xml-apis#xml-apis;2.0.2 relocated to xml-apis#xml-apis;1.0.b2.
22-Mar-2019 21:25:43 Please update your dependency to directly use the correct version 'xml-apis#xml-apis;1.0.b2'.
22-Mar-2019 21:25:43 Resolution will only pick dependencies of the relocated element.  Artifacts and other metadata will be ignored.
22-Mar-2019 21:25:44 Download https://repo.spring.io/plugins-release/org/asciidoctor/asciidoctor-gradle-plugin/1.5.0/asciidoctor-gradle-plugin-1.5.0.jar
22-Mar-2019 21:25:50 Defining custom 'build' task when using the standard Gradle lifecycle plugins has been deprecated and is scheduled to be removed in Gradle 3.0
22-Mar-2019 21:25:50 Cannot publish pom for project ':' since it does not contain the Maven plugin install task and task ':artifactoryPublish' does not specify a custom pom path.
22-Mar-2019 21:25:50 :clean UP-TO-DATE
22-Mar-2019 21:25:50 :spring-amqp:clean UP-TO-DATE
22-Mar-2019 21:25:50 :spring-rabbit:clean UP-TO-DATE
22-Mar-2019 21:25:51 :spring-amqp:compileJava
22-Mar-2019 21:25:51 Download https://repo.spring.io/libs-snapshot/org/springframework/spring-messaging/4.2.9.RELEASE/spring-messaging-4.2.9.RELEASE.pom
22-Mar-2019 21:25:51 Download https://repo.spring.io/libs-snapshot/org/springframework/spring-oxm/4.2.9.RELEASE/spring-oxm-4.2.9.RELEASE.pom
22-Mar-2019 21:25:51 Download https://repo.spring.io/libs-snapshot/com/fasterxml/jackson/core/jackson-core/2.3.2/jackson-core-2.3.2.pom
22-Mar-2019 21:25:52 Download https://repo.spring.io/libs-snapshot/com/fasterxml/jackson/core/jackson-databind/2.3.2/jackson-databind-2.3.2.pom
22-Mar-2019 21:25:53 Download https://repo.spring.io/libs-snapshot/org/springframework/spring-messaging/4.2.9.RELEASE/spring-messaging-4.2.9.RELEASE.jar
22-Mar-2019 21:25:54 Download https://repo.spring.io/libs-snapshot/org/springframework/spring-oxm/4.2.9.RELEASE/spring-oxm-4.2.9.RELEASE.jar
22-Mar-2019 21:25:54 Download https://repo.spring.io/libs-snapshot/com/fasterxml/jackson/core/jackson-core/2.3.2/jackson-core-2.3.2.jar
22-Mar-2019 21:25:55 Download https://repo.spring.io/libs-snapshot/com/fasterxml/jackson/core/jackson-databind/2.3.2/jackson-databind-2.3.2.jar
22-Mar-2019 21:25:56 :spring-amqp:processResources UP-TO-DATE
22-Mar-2019 21:25:56 :spring-amqp:classes
22-Mar-2019 21:25:56 :spring-amqp:jar
22-Mar-2019 21:26:06 :api
22-Mar-2019 21:26:06 :asciidoctor
22-Mar-2019 21:26:06 Download https://repo.spring.io/libs-snapshot/org/asciidoctor/asciidoctorj/1.5.0/asciidoctorj-1.5.0.pom
22-Mar-2019 21:26:07 Download https://repo.spring.io/libs-snapshot/org/jruby/jruby-complete/1.7.9/jruby-complete-1.7.9.pom
22-Mar-2019 21:26:07 Download https://repo.spring.io/libs-snapshot/org/jruby/jruby-parent/1.7.9/jruby-parent-1.7.9.pom
22-Mar-2019 21:26:12 Converting /opt/bamboo-home/xml-data/build-dir/AMQP-B15X-JOB1/src/reference/asciidoc/index.adoc
22-Mar-2019 21:26:12 Converting /opt/bamboo-home/xml-data/build-dir/AMQP-B15X-JOB1/src/reference/asciidoc/index.adoc
22-Mar-2019 21:26:16 :referenceEpub
22-Mar-2019 21:26:18 :referenceHtmlMulti
22-Mar-2019 21:26:19 :referenceHtmlSingle
22-Mar-2019 21:26:21 :referencePdf
22-Mar-2019 21:26:21 Font 'Symbol,normal,700' not found. Substituting with 'Symbol,normal,400'.
22-Mar-2019 21:26:21 Font 'ZapfDingbats,normal,700' not found. Substituting with 'ZapfDingbats,normal,400'.
22-Mar-2019 21:26:21 Font 'ZapfDingbats,italic,400' not found. Substituting with 'ZapfDingbats,normal,400'.
22-Mar-2019 21:26:21 Font 'ZapfDingbats,italic,700' not found. Substituting with 'any,italic,700'.
22-Mar-2019 21:26:22 :reference
22-Mar-2019 21:26:22 :docsZip
22-Mar-2019 21:26:22 :schemaZip
22-Mar-2019 21:26:24 :spring-amqp:javadoc
22-Mar-2019 21:26:24 :spring-amqp:javadocJar
22-Mar-2019 21:26:24 :spring-amqp:sourcesJar
22-Mar-2019 21:26:25 :spring-rabbit:compileJava
22-Mar-2019 21:26:25 :spring-rabbit:processResources
22-Mar-2019 21:26:25 :spring-rabbit:classes
22-Mar-2019 21:26:25 :spring-rabbit:jar
22-Mar-2019 21:26:28 :spring-rabbit:javadoc
22-Mar-2019 21:26:28 :spring-rabbit:javadocJar
22-Mar-2019 21:26:28 :spring-rabbit:sourcesJar
22-Mar-2019 21:26:28 :distZip
22-Mar-2019 21:26:28 :assemble
22-Mar-2019 21:26:28 :build
22-Mar-2019 21:26:28 :spring-amqp:assemble
22-Mar-2019 21:26:28 :spring-amqp:checkTestConfigs
22-Mar-2019 21:26:30 :spring-amqp:compileTestJava
22-Mar-2019 21:26:30 :spring-amqp:processTestResources
22-Mar-2019 21:26:30 :spring-amqp:testClasses
22-Mar-2019 21:26:30 :spring-amqp:test
22-Mar-2019 21:26:30 Download https://repo.spring.io/libs-snapshot/org/jacoco/org.jacoco.agent/0.7.2.201409121644/org.jacoco.agent-0.7.2.201409121644.pom
22-Mar-2019 21:26:30 Download https://repo.spring.io/libs-snapshot/org/jacoco/org.jacoco.build/0.7.2.201409121644/org.jacoco.build-0.7.2.201409121644.pom
22-Mar-2019 21:26:31 Download https://repo.spring.io/libs-snapshot/org/jacoco/org.jacoco.agent/0.7.2.201409121644/org.jacoco.agent-0.7.2.201409121644.jar
22-Mar-2019 21:26:34 :spring-amqp:check
22-Mar-2019 21:26:42 :spring-amqp:jacocoTestReport
22-Mar-2019 21:26:42 Download https://repo.spring.io/libs-snapshot/org/jacoco/org.jacoco.ant/0.7.2.201409121644/org.jacoco.ant-0.7.2.201409121644.pom
22-Mar-2019 21:26:42 Download https://repo.spring.io/libs-snapshot/org/jacoco/org.jacoco.core/0.7.2.201409121644/org.jacoco.core-0.7.2.201409121644.pom
22-Mar-2019 21:26:42 Download https://repo.spring.io/libs-snapshot/org/jacoco/org.jacoco.report/0.7.2.201409121644/org.jacoco.report-0.7.2.201409121644.pom
22-Mar-2019 21:26:43 Download https://repo.spring.io/libs-snapshot/org/jacoco/org.jacoco.ant/0.7.2.201409121644/org.jacoco.ant-0.7.2.201409121644.jar
22-Mar-2019 21:26:43 Download https://repo.spring.io/libs-snapshot/org/jacoco/org.jacoco.core/0.7.2.201409121644/org.jacoco.core-0.7.2.201409121644.jar
22-Mar-2019 21:26:43 Download https://repo.spring.io/libs-snapshot/org/jacoco/org.jacoco.report/0.7.2.201409121644/org.jacoco.report-0.7.2.201409121644.jar
22-Mar-2019 21:26:44 :spring-amqp:build
22-Mar-2019 21:26:44 :spring-rabbit:assemble
22-Mar-2019 21:26:44 :spring-rabbit:checkTestConfigs
22-Mar-2019 21:26:45 :spring-rabbit:compileTestJava
22-Mar-2019 21:26:45 :spring-rabbit:processTestResources
22-Mar-2019 21:26:45 :spring-rabbit:testClasses
22-Mar-2019 21:28:04 :spring-rabbit:test
22-Mar-2019 21:28:04
22-Mar-2019 21:28:04 org.springframework.amqp.rabbit.core.RabbitManagementTemplateTests > testDeleteExchange FAILED
22-Mar-2019 21:28:04     org.springframework.web.client.HttpClientErrorException at RabbitManagementTemplateTests.java:207
22-Mar-2019 21:28:42
22-Mar-2019 21:28:42 543 tests completed, 1 failed, 46 skipped
22-Mar-2019 21:28:42 :spring-rabbit:test FAILED
22-Mar-2019 21:28:42
22-Mar-2019 21:28:42 FAILURE: Build failed with an exception.
22-Mar-2019 21:28:42
22-Mar-2019 21:28:42 * What went wrong:
22-Mar-2019 21:28:42 Execution failed for task ':spring-rabbit:test'.
22-Mar-2019 21:28:42 > There were failing tests. See the report at: file:///opt/bamboo-home/xml-data/build-dir/AMQP-B15X-JOB1/spring-rabbit/build/reports/tests/index.html
22-Mar-2019 21:28:42
22-Mar-2019 21:28:42 * Try:
22-Mar-2019 21:28:42 Run with --stacktrace option to get the stack trace. Run with --info or --debug option to get more log output.
22-Mar-2019 21:28:42
22-Mar-2019 21:28:42 BUILD FAILED
22-Mar-2019 21:28:42
22-Mar-2019 21:28:42 Total time: 3 mins 10.365 secs
22-Mar-2019 21:28:43
22-Mar-2019 21:28:43 Failing task since return code of [./gradlew clean build dist -I /tmp/artifactory.init.script8200430474983689027gradle -DbuildInfoConfig.propertiesFile=/tmp/buildinfo4863440707472109760properties artifactoryPublish -Dartifactory.resolve.password=******** -Dartifactory.publish.password=********] was 1 while expected 0
22-Mar-2019 21:28:43 Parsing test results under /opt/bamboo-home/xml-data/build-dir/AMQP-B15X-JOB1...
22-Mar-2019 21:28:43 Finished task 'Artifactory Gradle' with result: Failed
22-Mar-2019 21:28:43 Running post build plugin 'Docker Container Cleanup'
22-Mar-2019 21:28:43 Running post build plugin 'NCover Results Collector'
22-Mar-2019 21:28:43 Running post build plugin 'Artifactory Release Management Staging'
22-Mar-2019 21:28:43 Running post build plugin 'Artifactory Build Info Copier'
22-Mar-2019 21:28:43 Running post build plugin 'Artifactory Gradle Properties Info Copier'
22-Mar-2019 21:28:43 Running post build plugin 'Clover Results Collector'
22-Mar-2019 21:28:43 Running post build plugin 'npm Cache Cleanup'
22-Mar-2019 21:28:43 Running post build plugin 'Artifact Copier'
22-Mar-2019 21:28:43 Publishing an artifact: Test Results
22-Mar-2019 21:28:43 Finished publishing of artifact Job artifact: [Test Results], pattern: [*/build/reports/tests/**/*.*] in 61.32 ms
22-Mar-2019 21:28:43 Successfully removed working directory at '/opt/bamboo-home/xml-data/build-dir/AMQP-B15X-JOB1'
22-Mar-2019 21:28:43 Finalising the build...
22-Mar-2019 21:28:43 Stopping timer.
22-Mar-2019 21:28:43 Build AMQP-B15X-JOB1-40 completed.
22-Mar-2019 21:28:43 Running on server: post build plugin 'NCover Results Collector'
22-Mar-2019 21:28:43 Running on server: post build plugin 'Build Hanging Detection Configuration'
22-Mar-2019 21:28:43 Running on server: post build plugin 'Clover Delta Calculator'
22-Mar-2019 21:28:43 Running on server: post build plugin 'Maven Dependencies Postprocessor'
22-Mar-2019 21:28:43 All post build plugins have finished
22-Mar-2019 21:28:43 Generating build results summary...
22-Mar-2019 21:28:43 Saving build results to disk...
22-Mar-2019 21:28:43 Logging substituted variables...
22-Mar-2019 21:28:43 Indexing build results...
22-Mar-2019 21:28:44 Finished building AMQP-B15X-JOB1-40.