1.5.x Branch

Build: #42 failed

Job: Default Job failed

Stages & jobs

  1. Default Stage

Test results

  • 682 tests in total
  • 1 test failed
  • 46 tests were quarantined / skipped
  • 1 minute taken in total.

Build 42 has the following 1 errors:There were no new test failures since the previous build.

Existing test failures 1
Status Test Failing since Duration
org.springframework.web.client.HttpClientErrorException: org.springframework.web.client.HttpClientErrorException: 415 Unsupported Media Type
org.springframework.web.client.HttpClientErrorException: 415 Unsupported Media Type
	at org.springframework.web.client.DefaultResponseErrorHandler.handleError(DefaultResponseErrorHandler.java:91)
	at org.springframework.web.client.RestTemplate.handleResponse(RestTemplate.java:641)
	at org.springframework.web.client.RestTemplate.doExecute(RestTemplate.java:597)
	at org.springframework.web.client.RestTemplate.execute(RestTemplate.java:572)
	at org.springframework.web.client.RestTemplate.put(RestTemplate.java:421)
	at com.rabbitmq.http.client.Client.declareExchange(Client.java:261)
(47 more lines...)