1.5.x Branch

Build: #43 failed

Job: Default Job failed

Stages & jobs

  1. Default Stage

Job result summary

3 minutes
dec8dbf42533ea445e56b9c3d0fd3c94760e0b10 dec8dbf42533ea445e56b9c3d0fd3c94760e0b10
Total tests
Failing since
#39 (Code changes detected – )


  • 682 tests in total
  • 1 test failed
  • 46 tests were quarantined / skipped
  • 1 minute taken in total.
Existing test failures 1
Status Test Failing since Duration
org.springframework.web.client.HttpClientErrorException: org.springframework.web.client.HttpClientErrorException: 415 Unsupported Media Type
org.springframework.web.client.HttpClientErrorException: 415 Unsupported Media Type
	at org.springframework.web.client.DefaultResponseErrorHandler.handleError(DefaultResponseErrorHandler.java:91)
	at org.springframework.web.client.RestTemplate.handleResponse(RestTemplate.java:641)
	at org.springframework.web.client.RestTemplate.doExecute(RestTemplate.java:597)
	at org.springframework.web.client.RestTemplate.execute(RestTemplate.java:572)
	at org.springframework.web.client.RestTemplate.put(RestTemplate.java:421)
	at com.rabbitmq.http.client.Client.declareExchange(Client.java:261)
(47 more lines...)

Error summary

The build generated some errors. See the full build log for more details.

POM relocation to an other version number is not fully supported in Gradle : xml-apis#xml-apis;2.0.2 relocated to xml-apis#xml-apis;1.0.b2.

543 tests completed, 1 failed, 46 skipped

FAILURE: Build failed with an exception.

* What went wrong:
Execution failed for task ':spring-rabbit:test'.
> There were failing tests. See the report at: file:///opt/bamboo-home/xml-data/build-dir/AMQP-B15X-JOB1/spring-rabbit/build/reports/tests/index.html

* Try:
Run with --stacktrace option to get the stack trace. Run with --info or --debug option to get more log output.