1.5.x Branch

Build: #43 failed

Job: Default Job failed

Stages & jobs

  1. Default Stage

Build log

The build generated 195 lines of output. Download or view full build log

28-Mar-2019 11:25:21 Build Spring AMQP - 1.5.x - Default Job #43 (AMQP-B15X-JOB1-43) started building on agent bamboo-04.af.pivotal.io
28-Mar-2019 11:25:21 Remote agent on host bamboo-04.af.pivotal.io
28-Mar-2019 11:25:21 Build working directory is /opt/bamboo-home/xml-data/build-dir/AMQP-B15X-JOB1
28-Mar-2019 11:25:21 Executing build Spring AMQP - 1.5.x - Default Job #43 (AMQP-B15X-JOB1-43)
28-Mar-2019 11:25:21 Starting task 'Checkout Default Repository' of type 'com.atlassian.bamboo.plugins.vcs:task.vcs.checkout'
28-Mar-2019 11:25:21 Build always requires a clean checkout
28-Mar-2019 11:25:21 Cleaning build directory '/opt/bamboo-home/xml-data/build-dir/AMQP-B15X-JOB1'
28-Mar-2019 11:25:21 Checking out into /opt/bamboo-home/xml-data/build-dir/AMQP-B15X-JOB1
28-Mar-2019 11:25:21 Updating source code to revision: dec8dbf42533ea445e56b9c3d0fd3c94760e0b10
28-Mar-2019 11:25:21 Creating local git repository in '/opt/bamboo-home/xml-data/build-dir/AMQP-B15X-JOB1/.git'.
28-Mar-2019 11:25:21 Initialized empty Git repository in /opt/bamboo-home/xml-data/build-dir/AMQP-B15X-JOB1/.git/
28-Mar-2019 11:25:22 Fetching 'refs/heads/1.5.x' from 'https://github.com/spring-projects/spring-amqp.git'.
28-Mar-2019 11:25:23 From https://github.com/spring-projects/spring-amqp
28-Mar-2019 11:25:23 * [new branch]      1.5.x      -> 1.5.x
28-Mar-2019 11:25:23 * [new tag]         1.0.0.M1   -> 1.0.0.M1
28-Mar-2019 11:25:23 * [new tag]         1.0.0.M2   -> 1.0.0.M2
28-Mar-2019 11:25:23 * [new tag]         1.1.0.RELEASE -> 1.1.0.RELEASE
28-Mar-2019 11:25:23 * [new tag]         1.1.1.RELEASE -> 1.1.1.RELEASE
28-Mar-2019 11:25:23 * [new tag]         1.5.6.RELEASE -> 1.5.6.RELEASE
28-Mar-2019 11:25:23 * [new tag]         v1.2.0.RC1 -> v1.2.0.RC1
28-Mar-2019 11:25:23 * [new tag]         v1.2.0.RELEASE -> v1.2.0.RELEASE
28-Mar-2019 11:25:23 * [new tag]         v1.2.0a.M1 -> v1.2.0a.M1
28-Mar-2019 11:25:23 * [new tag]         v1.3.0.M1  -> v1.3.0.M1
28-Mar-2019 11:25:23 * [new tag]         v1.3.0.M2  -> v1.3.0.M2
28-Mar-2019 11:25:23 * [new tag]         v1.3.0.RC1 -> v1.3.0.RC1
28-Mar-2019 11:25:23 * [new tag]         v1.3.0.RELEASE -> v1.3.0.RELEASE
28-Mar-2019 11:25:23 * [new tag]         v1.3.1.RELEASE -> v1.3.1.RELEASE
28-Mar-2019 11:25:23 * [new tag]         v1.3.2.RELEASE -> v1.3.2.RELEASE
28-Mar-2019 11:25:23 * [new tag]         v1.3.3.RELEASE -> v1.3.3.RELEASE
28-Mar-2019 11:25:23 * [new tag]         v1.3.4.RELEASE -> v1.3.4.RELEASE
28-Mar-2019 11:25:23 * [new tag]         v1.4.0.M1  -> v1.4.0.M1
28-Mar-2019 11:25:23 * [new tag]         v1.4.0.RC1 -> v1.4.0.RC1
28-Mar-2019 11:25:23 * [new tag]         v1.4.0.RELEASE -> v1.4.0.RELEASE
28-Mar-2019 11:25:23 * [new tag]         v1.4.1.RELEASE -> v1.4.1.RELEASE
28-Mar-2019 11:25:23 * [new tag]         v1.4.2.M1  -> v1.4.2.M1
28-Mar-2019 11:25:23 * [new tag]         v1.4.2.M2  -> v1.4.2.M2
28-Mar-2019 11:25:23 * [new tag]         v1.4.2.RELEASE -> v1.4.2.RELEASE
28-Mar-2019 11:25:23 * [new tag]         v1.5.0.M1  -> v1.5.0.M1
28-Mar-2019 11:25:23 * [new tag]         v1.5.0.RC1 -> v1.5.0.RC1
28-Mar-2019 11:25:23 * [new tag]         v1.5.0.RELEASE -> v1.5.0.RELEASE
28-Mar-2019 11:25:23 * [new tag]         v1.5.1.RELEASE -> v1.5.1.RELEASE
28-Mar-2019 11:25:23 * [new tag]         v1.5.2.RELEASE -> v1.5.2.RELEASE
28-Mar-2019 11:25:23 * [new tag]         v1.5.3.RELEASE -> v1.5.3.RELEASE
28-Mar-2019 11:25:23 * [new tag]         v1.5.4.RELEASE -> v1.5.4.RELEASE
28-Mar-2019 11:25:23 * [new tag]         v1.5.5.RELEASE -> v1.5.5.RELEASE
28-Mar-2019 11:25:23 * [new tag]         v1.5.7.RELEASE -> v1.5.7.RELEASE
28-Mar-2019 11:25:24 Checking out revision dec8dbf42533ea445e56b9c3d0fd3c94760e0b10.
28-Mar-2019 11:25:24 Switched to branch '1.5.x'
28-Mar-2019 11:25:24 Updated source code to revision: dec8dbf42533ea445e56b9c3d0fd3c94760e0b10
28-Mar-2019 11:25:24 Finished task 'Checkout Default Repository' with result: Success
28-Mar-2019 11:25:24 Running pre-build action: Artifactory Release Staging
28-Mar-2019 11:25:24 Running pre-build action: VCS Version Collector
28-Mar-2019 11:25:24 Starting task 'Artifactory Gradle' of type 'org.jfrog.bamboo.bamboo-artifactory-plugin:artifactoryGradleTask'
28-Mar-2019 11:25:24 Bamboo Artifactory Plugin version: 2.5.x-SNAPSHOT
28-Mar-2019 11:25:24
Beginning to execute external process for build 'Spring AMQP - 1.5.x - Default Job #43 (AMQP-B15X-JOB1-43)'
... running command line:
./gradlew clean build dist -I /tmp/artifactory.init.script8897169349642430767gradle -DbuildInfoConfig.propertiesFile=/tmp/buildinfo3389476785545003795properties artifactoryPublish -Dartifactory.resolve.password=******** -Dartifactory.publish.password=********
... in: /opt/bamboo-home/xml-data/build-dir/AMQP-B15X-JOB1
... using extra environment variables:
bamboo_planRepository_1_branch=1.5.x
bamboo_********_username_password=********
bamboo_signing_store_password=********
bamboo_capability_system_builder_ant_Ant_1_9=/opt/ant-1.9
bamboo_capability_system_builder_ant_Ant_1_8=/opt/ant-1.8
bamboo_planRepository_1_branchDisplayName=1.5.x
bamboo_capability_system_jdk_OpenJDK_7u181=/opt/openjdk-7
bamboo_repository_revision_number=dec8dbf42533ea445e56b9c3d0fd3c94760e0b10
bamboo_capability_system_builder_node_Node_js_6=/usr/bin/node
bamboo_RIAK_BIN=/usr/sbin/riak
WRAPPER_BITS=32
bamboo_buildKey=AMQP-B15X-JOB1
bamboo_bintray_password=********
bamboo_sonar_token_password=********
PWD=/opt/bamboo-home/bin
bamboo_shortJobName=Default Job
bamboo_capability_system_builder_gradle___gradlew=./gradlew
bamboo_buildResultsUrl=https://build.spring.io/browse/AMQP-B15X-JOB1-43
bamboo_capability_system_builder_mvn3_Maven_3_3=/opt/maven-3.3
bamboo_capability_system_builder_mvn3_Maven_3_2=/opt/maven-3.2
bamboo_capability_system_builder_mvn3_Maven_3_1=/opt/maven-3.1
bamboo_planRepository_repositoryUrl=https://github.com/spring-projects/spring-amqp.git
bamboo_agentId=208568323
bamboo_capability_system_builder_mvn3_Maven_3_5=/opt/maven-3.5
bamboo_capability_system_builder_mvn3_Maven_3_0=/opt/maven-3.0
bamboo_planRepository_revision=dec8dbf42533ea445e56b9c3d0fd3c94760e0b10
bamboo_planRepository_previousRevision=73baf78b11f57a92d69f934a448f5b9060b320f8
bamboo_capability_remote_build=true
bamboo_repository_branch_name=1.5.x
bamboo_sonatype_token_password=********
SHLVL=1
bamboo_org_jfrog_bamboo_buildInfo_serverUrl=https://repo.spring.io
bamboo_scdf_acceptance_tests_password=********
WRAPPER_OS=linux
JAVA_HOME=/opt/jdk-8/
XDG_SESSION_ID=20579
bamboo_capability_Agent=bamboo-04.af.pivotal.io
bamboo_planRepository_branch=1.5.x
bamboo_org_jfrog_bamboo_release_activated=false
bamboo_planRepository_1_type=gitv2
bamboo_planRepository_branchName=1.5.x
bamboo_capability_system_jdk_JDK_12=/opt/jdk-12
WRAPPER_FILE_SEPARATOR=/
_=./bamboo-agent.sh
SSH_CLIENT=10.255.200.169 54114 22
WRAPPER_PATH_SEPARATOR=:
bamboo_sonar_password=********
bamboo_hg_cache_directory=/opt/bamboo-home/xml-data/build-dir/_hg-repositories-cache
bamboo_planRepository_1_username=spring-buildmaster
bamboo_planRepository_type=gitv2
bamboo_git_cache_directory=/opt/bamboo-home/xml-data/build-dir/_git-repositories-cache
bamboo_artifactory_username=buildmaster
bamboo_tmp_directory=/opt/bamboo-home/temp
SSH_CONNECTION=10.255.200.169 54114 10.194.6.14 22
bamboo_planKey=AMQP-B15X
bamboo_planRepository_username=spring-buildmaster
bamboo_JDK8_HOME=/opt/jdk-8
NLSPATH=/usr/dt/lib/nls/msg/%L/%N.cat
bamboo_planRepository_1_branchName=1.5.x
bamboo_sonar_version=5.6.3
GRADLE_OPTS= -Xms128m -Xmx1024m
bamboo_capability_system_jdk_JDK_1_11=/opt/jdk-11
bamboo_resultsUrl=https://build.spring.io/browse/AMQP-B15X-JOB1-43
bamboo_capability_system_jdk_JDK_1_10=/opt/jdk-10
bamboo_build_working_directory=/opt/bamboo-home/xml-data/build-dir/AMQP-B15X-JOB1
bamboo_planRepository_1_name=Plan Repository
bamboo_capability_system_os=ubuntu1604
bamboo_nexusPush_stagingProfile=buildmaster
bamboo_shortPlanName=1.5.x
MAIL=/var/mail/bamboo
bamboo_planRepository_name=Plan Repository
LOGNAME=bamboo
bamboo_buildNumber=43
SHELL=/bin/bash
bamboo_repository_193953800_previous_revision_number=73baf78b11f57a92d69f934a448f5b9060b320f8
bamboo_planName=Spring AMQP - 1.5.x
bamboo_JDK7_HOME=/opt/jdk-7
bamboo_shortPlanKey=B15X
OLDPWD=/opt/bamboo-home/bin
bamboo_shortJobKey=JOB1
bamboo_artifactory_password=********
bamboo_buildTimeStamp=2019-03-28T11:25:21.570Z
bamboo_repository_previous_revision_number=73baf78b11f57a92d69f934a448f5b9060b320f8
bamboo_sonar_username=buildmaster
bamboo_********_password=********
bamboo_repository_git_branch=1.5.x
bamboo_buildResultKey=AMQP-B15X-JOB1-43
bamboo_repository_193953800_git_username=spring-buildmaster
bamboo_nexusPush_close=true
bamboo_buildPlanName=Spring AMQP - 1.5.x - Default Job
bamboo_repository_193953800_revision_number=dec8dbf42533ea445e56b9c3d0fd3c94760e0b10
bamboo_planRepository_1_revision=dec8dbf42533ea445e56b9c3d0fd3c94760e0b10
bamboo_repository_name=Plan Repository
bamboo_signing_key_password=********
XFILESEARCHPATH=/usr/dt/app-defaults/%L/Dt
LANG=en_US.UTF-8
bamboo_buildFailed=false
bamboo_repository_193953800_git_branch=1.5.x
bamboo_capability_system_docker_executable=/usr/bin/docker
bamboo_capability_system_builder_groovy_Groovy_2_4=/opt/groovy-2.4
bamboo_artifactory_password_mask_b=********
bamboo_capability_system_builder_command_Bash=/bin/bash
bamboo_artifactory_password_mask_a=********
bamboo_agentWorkingDirectory=/opt/bamboo-home/xml-data/build-dir
bamboo_capability_system_git_executable=/usr/bin/git
bamboo_repository_git_username=spring-buildmaster
bamboo_planRepository_1_previousRevision=73baf78b11f57a92d69f934a448f5b9060b320f8
bamboo_capability_os_family=unix
bamboo_planRepository_branchDisplayName=1.5.x
bamboo_capability_system_builder_maven_Artifactory_Maven_3_5=/opt/maven-3.5
bamboo_capability_system_builder_maven_Artifactory_Maven_3_3=/opt/maven-3.3
bamboo_capability_system_builder_maven_Artifactory_Maven_3_2=/opt/maven-3.2
bamboo_s3_properties=/home/bamboo/tools/s3.properties
bamboo_capability_system_builder_maven_Artifactory_Maven_3_1=/opt/maven-3.1
bamboo_capability_system_builder_maven_Artifactory_Maven_3_0=/opt/maven-3.0
bamboo_plan_storageTag=AMQP-B15X
bamboo_bintray_username_password=********
USER=bamboo
bamboo_repository_git_repositoryUrl=https://github.com/spring-projects/spring-amqp.git
bamboo_repository_193953800_branch_name=1.5.x
SSH_AUTH_SOCK=/tmp/ssh-0fXaeVHkoB/agent.3136
bamboo_repository_193953800_git_repositoryUrl=https://github.com/spring-projects/spring-amqp.git
bamboo_working_directory=/opt/bamboo-home/xml-data/build-dir/AMQP-B15X-JOB1
bamboo_org_jfrog_bamboo_buildInfo_activated=true
bamboo_repository_193953800_name=Plan Repository
bamboo_planRepository_1_repositoryUrl=https://github.com/spring-projects/spring-amqp.git
bamboo_capability_system_jdk_JDK_1_8=/opt/jdk-8
bamboo_capability_system_jdk_JDK_1_9=/opt/jdk-9
WRAPPER_ARCH=x86
bamboo_capability_system_jdk_JDK_1_6=/opt/jdk-6
bamboo_sonatype_password=********
bamboo_capability_system_jdk_JDK_1_7=/opt/jdk-7
bamboo_sonar_ip=10.194.6.9
XDG_RUNTIME_DIR=/run/user/505
HOME=/home/bamboo
PATH=/bin:/usr/local/sbin:/usr/local/bin:/usr/sbin:/usr/bin:/sbin:/bin:/usr/games:/usr/local/games:/bin:/usr/local/sbin:/usr/local/bin:/usr/sbin:/usr/bin:/sbin:/bin:/usr/games:/usr/local/games
28-Mar-2019 11:25:24 Downloading https://services.gradle.org/distributions/gradle-2.5-all.zip
28-Mar-2019 11:25:26 ...................................................................................................................................................................................................................................................................................................................................................................................................................................................................................................................................................................................................................................................................................................................................................................................................................................................................................................................................................................................................................................................................................................................................................................................................................................................................................................................................................................................................................................................................................................................................................................................................................................................................................................................................................................................................................................................................................................................................................................................................................................................................................................................................................................................................................................................................................................................................................................................................................................................................................................................................................................................................................................................................................................................................................................................................................................................................................................................................................................................................................................................................................................................................................................................................................................................................................................................................................................................
28-Mar-2019 11:25:26 Unzipping /home/bamboo/.gradle/wrapper/dists/gradle-2.5-all/d3xh0kipe7wr2bvnx5sk0hao8/gradle-2.5-all.zip to /home/bamboo/.gradle/wrapper/dists/gradle-2.5-all/d3xh0kipe7wr2bvnx5sk0hao8
28-Mar-2019 11:25:27 Set executable permissions for: /home/bamboo/.gradle/wrapper/dists/gradle-2.5-all/d3xh0kipe7wr2bvnx5sk0hao8/gradle-2.5/bin/gradle
28-Mar-2019 11:25:30 Download https://repo.spring.io/plugins-release/io/spring/gradle/docbook-reference-plugin/0.3.1/docbook-reference-plugin-0.3.1.pom
28-Mar-2019 11:25:31 Download https://repo.spring.io/plugins-release/org/asciidoctor/asciidoctor-gradle-plugin/1.5.0/asciidoctor-gradle-plugin-1.5.0.pom
28-Mar-2019 11:25:35 POM relocation to an other version number is not fully supported in Gradle : xml-apis#xml-apis;2.0.2 relocated to xml-apis#xml-apis;1.0.b2.
28-Mar-2019 11:25:35 Please update your dependency to directly use the correct version 'xml-apis#xml-apis;1.0.b2'.
28-Mar-2019 11:25:35 Resolution will only pick dependencies of the relocated element.  Artifacts and other metadata will be ignored.
28-Mar-2019 11:25:35 Download https://repo.spring.io/plugins-release/io/spring/gradle/docbook-reference-plugin/0.3.1/docbook-reference-plugin-0.3.1.jar
28-Mar-2019 11:25:36 Download https://repo.spring.io/plugins-release/org/asciidoctor/asciidoctor-gradle-plugin/1.5.0/asciidoctor-gradle-plugin-1.5.0.jar
28-Mar-2019 11:25:39 Download https://repo.spring.io/plugins-release/net/sf/docbook/docbook-xsl/1.78.1/docbook-xsl-1.78.1-resources.zip
28-Mar-2019 11:25:42 Defining custom 'build' task when using the standard Gradle lifecycle plugins has been deprecated and is scheduled to be removed in Gradle 3.0
28-Mar-2019 11:25:42 Cannot publish pom for project ':' since it does not contain the Maven plugin install task and task ':artifactoryPublish' does not specify a custom pom path.
28-Mar-2019 11:25:42 :clean UP-TO-DATE
28-Mar-2019 11:25:42 :spring-amqp:clean UP-TO-DATE
28-Mar-2019 11:25:42 :spring-rabbit:clean UP-TO-DATE
28-Mar-2019 11:25:42 :spring-amqp:compileJava
28-Mar-2019 11:25:42 Download https://repo.spring.io/libs-snapshot/org/springframework/spring-messaging/4.2.9.RELEASE/spring-messaging-4.2.9.RELEASE.pom
28-Mar-2019 11:25:42 Download https://repo.spring.io/libs-snapshot/org/springframework/spring-oxm/4.2.9.RELEASE/spring-oxm-4.2.9.RELEASE.pom
28-Mar-2019 11:25:43 Download https://repo.spring.io/libs-snapshot/com/fasterxml/jackson/core/jackson-core/2.3.2/jackson-core-2.3.2.pom
28-Mar-2019 11:25:43 Download https://repo.spring.io/libs-snapshot/com/fasterxml/jackson/core/jackson-databind/2.3.2/jackson-databind-2.3.2.pom
28-Mar-2019 11:25:45 Download https://repo.spring.io/libs-snapshot/org/springframework/spring-messaging/4.2.9.RELEASE/spring-messaging-4.2.9.RELEASE.jar
28-Mar-2019 11:25:45 Download https://repo.spring.io/libs-snapshot/org/springframework/spring-oxm/4.2.9.RELEASE/spring-oxm-4.2.9.RELEASE.jar
28-Mar-2019 11:25:46 Download https://repo.spring.io/libs-snapshot/com/fasterxml/jackson/core/jackson-core/2.3.2/jackson-core-2.3.2.jar
28-Mar-2019 11:25:46 Download https://repo.spring.io/libs-snapshot/com/fasterxml/jackson/core/jackson-databind/2.3.2/jackson-databind-2.3.2.jar
28-Mar-2019 11:25:47 :spring-amqp:processResources UP-TO-DATE
28-Mar-2019 11:25:47 :spring-amqp:classes
28-Mar-2019 11:25:48 :spring-amqp:jar
28-Mar-2019 11:25:48 :api
28-Mar-2019 11:25:48 Download https://repo.spring.io/libs-snapshot/org/springframework/retry/spring-retry/1.1.2.RELEASE/spring-retry-1.1.2.RELEASE.pom
28-Mar-2019 11:25:49 Download https://repo.spring.io/libs-snapshot/org/apache/httpcomponents/httpcomponents-client/4.3.6/httpcomponents-client-4.3.6.pom
28-Mar-2019 11:25:49 Download https://repo.spring.io/libs-snapshot/org/slf4j/slf4j-parent/1.7.6/slf4j-parent-1.7.6.pom
28-Mar-2019 11:25:50 Download https://repo.spring.io/libs-snapshot/com/fasterxml/oss-parent/18/oss-parent-18.pom
28-Mar-2019 11:25:52 Download https://repo.spring.io/libs-snapshot/org/springframework/retry/spring-retry/1.1.2.RELEASE/spring-retry-1.1.2.RELEASE.jar
28-Mar-2019 11:25:52 Download https://repo.spring.io/libs-snapshot/com/fasterxml/jackson/core/jackson-databind/2.5.1/jackson-databind-2.5.1.jar
28-Mar-2019 11:25:52 Download https://repo.spring.io/libs-snapshot/com/fasterxml/jackson/core/jackson-annotations/2.5.0/jackson-annotations-2.5.0.jar
28-Mar-2019 11:25:53 Download https://repo.spring.io/libs-snapshot/com/fasterxml/jackson/core/jackson-core/2.5.1/jackson-core-2.5.1.jar
28-Mar-2019 11:25:57 :asciidoctor
28-Mar-2019 11:25:57 Download https://repo.spring.io/libs-snapshot/org/asciidoctor/asciidoctorj/1.5.0/asciidoctorj-1.5.0.pom
28-Mar-2019 11:25:57 Download https://repo.spring.io/libs-snapshot/org/slf4j/slf4j-parent/1.7.5/slf4j-parent-1.7.5.pom
28-Mar-2019 11:25:58 Download https://repo.spring.io/libs-snapshot/org/jruby/jruby-complete/1.7.9/jruby-complete-1.7.9.pom
28-Mar-2019 11:25:58 Download https://repo.spring.io/libs-snapshot/org/jruby/jruby-parent/1.7.9/jruby-parent-1.7.9.pom
28-Mar-2019 11:26:02 Converting /opt/bamboo-home/xml-data/build-dir/AMQP-B15X-JOB1/src/reference/asciidoc/index.adoc
28-Mar-2019 11:26:02 Converting /opt/bamboo-home/xml-data/build-dir/AMQP-B15X-JOB1/src/reference/asciidoc/index.adoc
28-Mar-2019 11:26:06 :referenceEpub
28-Mar-2019 11:26:08 :referenceHtmlMulti
28-Mar-2019 11:26:09 :referenceHtmlSingle
28-Mar-2019 11:26:11 :referencePdf
28-Mar-2019 11:26:11 Font 'Symbol,normal,700' not found. Substituting with 'Symbol,normal,400'.
28-Mar-2019 11:26:11 Font 'ZapfDingbats,normal,700' not found. Substituting with 'ZapfDingbats,normal,400'.
28-Mar-2019 11:26:11 Font 'ZapfDingbats,italic,400' not found. Substituting with 'ZapfDingbats,normal,400'.
28-Mar-2019 11:26:11 Font 'ZapfDingbats,italic,700' not found. Substituting with 'any,italic,700'.
28-Mar-2019 11:26:12 :reference
28-Mar-2019 11:26:12 :docsZip
28-Mar-2019 11:26:12 :schemaZip
28-Mar-2019 11:26:14 :spring-amqp:javadoc
28-Mar-2019 11:26:14 :spring-amqp:javadocJar
28-Mar-2019 11:26:14 :spring-amqp:sourcesJar
28-Mar-2019 11:26:14 :spring-rabbit:compileJava
28-Mar-2019 11:26:14 :spring-rabbit:processResources
28-Mar-2019 11:26:14 :spring-rabbit:classes
28-Mar-2019 11:26:14 :spring-rabbit:jar
28-Mar-2019 11:26:17 :spring-rabbit:javadoc
28-Mar-2019 11:26:17 :spring-rabbit:javadocJar
28-Mar-2019 11:26:17 :spring-rabbit:sourcesJar
28-Mar-2019 11:26:18 :distZip
28-Mar-2019 11:26:18 :assemble
28-Mar-2019 11:26:18 :build
28-Mar-2019 11:26:18 :spring-amqp:assemble
28-Mar-2019 11:26:18 :spring-amqp:checkTestConfigs
28-Mar-2019 11:26:19 :spring-amqp:compileTestJava
28-Mar-2019 11:26:19 :spring-amqp:processTestResources
28-Mar-2019 11:26:19 :spring-amqp:testClasses
28-Mar-2019 11:26:19 :spring-amqp:test
28-Mar-2019 11:26:19 Download https://repo.spring.io/libs-snapshot/org/jacoco/org.jacoco.agent/0.7.2.201409121644/org.jacoco.agent-0.7.2.201409121644.pom
28-Mar-2019 11:26:20 Download https://repo.spring.io/libs-snapshot/org/jacoco/org.jacoco.build/0.7.2.201409121644/org.jacoco.build-0.7.2.201409121644.pom
28-Mar-2019 11:26:20 Download https://repo.spring.io/libs-snapshot/org/jacoco/org.jacoco.agent/0.7.2.201409121644/org.jacoco.agent-0.7.2.201409121644.jar
28-Mar-2019 11:26:23 :spring-amqp:check
28-Mar-2019 11:26:23 :spring-amqp:jacocoTestReport
28-Mar-2019 11:26:23 Download https://repo.spring.io/libs-snapshot/org/jacoco/org.jacoco.ant/0.7.2.201409121644/org.jacoco.ant-0.7.2.201409121644.pom
28-Mar-2019 11:26:24 Download https://repo.spring.io/libs-snapshot/org/jacoco/org.jacoco.core/0.7.2.201409121644/org.jacoco.core-0.7.2.201409121644.pom
28-Mar-2019 11:26:24 Download https://repo.spring.io/libs-snapshot/org/jacoco/org.jacoco.report/0.7.2.201409121644/org.jacoco.report-0.7.2.201409121644.pom
28-Mar-2019 11:26:24 Download https://repo.spring.io/libs-snapshot/org/jacoco/org.jacoco.ant/0.7.2.201409121644/org.jacoco.ant-0.7.2.201409121644.jar
28-Mar-2019 11:26:25 Download https://repo.spring.io/libs-snapshot/org/jacoco/org.jacoco.core/0.7.2.201409121644/org.jacoco.core-0.7.2.201409121644.jar
28-Mar-2019 11:26:25 Download https://repo.spring.io/libs-snapshot/org/jacoco/org.jacoco.report/0.7.2.201409121644/org.jacoco.report-0.7.2.201409121644.jar
28-Mar-2019 11:26:26 :spring-amqp:build
28-Mar-2019 11:26:26 :spring-rabbit:assemble
28-Mar-2019 11:26:26 :spring-rabbit:checkTestConfigs
28-Mar-2019 11:26:27 :spring-rabbit:compileTestJava
28-Mar-2019 11:26:27 :spring-rabbit:processTestResources
28-Mar-2019 11:26:27 :spring-rabbit:testClasses
28-Mar-2019 11:27:53 :spring-rabbit:test
28-Mar-2019 11:27:53
28-Mar-2019 11:27:53 org.springframework.amqp.rabbit.core.RabbitManagementTemplateTests > testDeleteExchange FAILED
28-Mar-2019 11:27:53     org.springframework.web.client.HttpClientErrorException at RabbitManagementTemplateTests.java:207
28-Mar-2019 11:28:35
28-Mar-2019 11:28:35 543 tests completed, 1 failed, 46 skipped
28-Mar-2019 11:28:35 :spring-rabbit:test FAILED
28-Mar-2019 11:28:35
28-Mar-2019 11:28:35 FAILURE: Build failed with an exception.
28-Mar-2019 11:28:35
28-Mar-2019 11:28:35 * What went wrong:
28-Mar-2019 11:28:35 Execution failed for task ':spring-rabbit:test'.
28-Mar-2019 11:28:35 > There were failing tests. See the report at: file:///opt/bamboo-home/xml-data/build-dir/AMQP-B15X-JOB1/spring-rabbit/build/reports/tests/index.html
28-Mar-2019 11:28:35
28-Mar-2019 11:28:35 * Try:
28-Mar-2019 11:28:35 Run with --stacktrace option to get the stack trace. Run with --info or --debug option to get more log output.
28-Mar-2019 11:28:35
28-Mar-2019 11:28:35 BUILD FAILED
28-Mar-2019 11:28:35
28-Mar-2019 11:28:35 Total time: 3 mins 11.533 secs
28-Mar-2019 11:28:36
28-Mar-2019 11:28:36 Failing task since return code of [./gradlew clean build dist -I /tmp/artifactory.init.script8897169349642430767gradle -DbuildInfoConfig.propertiesFile=/tmp/buildinfo3389476785545003795properties artifactoryPublish -Dartifactory.resolve.password=******** -Dartifactory.publish.password=********] was 1 while expected 0
28-Mar-2019 11:28:36 Parsing test results under /opt/bamboo-home/xml-data/build-dir/AMQP-B15X-JOB1...
28-Mar-2019 11:28:36 Finished task 'Artifactory Gradle' with result: Failed
28-Mar-2019 11:28:36 Running post build plugin 'Docker Container Cleanup'
28-Mar-2019 11:28:36 Running post build plugin 'NCover Results Collector'
28-Mar-2019 11:28:36 Running post build plugin 'Artifactory Release Management Staging'
28-Mar-2019 11:28:36 Running post build plugin 'Artifactory Build Info Copier'
28-Mar-2019 11:28:36 Running post build plugin 'Artifactory Gradle Properties Info Copier'
28-Mar-2019 11:28:36 Running post build plugin 'Clover Results Collector'
28-Mar-2019 11:28:36 Running post build plugin 'npm Cache Cleanup'
28-Mar-2019 11:28:36 Running post build plugin 'Artifact Copier'
28-Mar-2019 11:28:36 Publishing an artifact: Test Results
28-Mar-2019 11:28:36 Finished publishing of artifact Job artifact: [Test Results], pattern: [*/build/reports/tests/**/*.*] in 64.61 ms
28-Mar-2019 11:28:36 Successfully removed working directory at '/opt/bamboo-home/xml-data/build-dir/AMQP-B15X-JOB1'
28-Mar-2019 11:28:36 Finalising the build...
28-Mar-2019 11:28:36 Stopping timer.
28-Mar-2019 11:28:36 Build AMQP-B15X-JOB1-43 completed.
28-Mar-2019 11:28:36 Running on server: post build plugin 'NCover Results Collector'
28-Mar-2019 11:28:36 Running on server: post build plugin 'Build Hanging Detection Configuration'
28-Mar-2019 11:28:36 Running on server: post build plugin 'Clover Delta Calculator'
28-Mar-2019 11:28:36 Running on server: post build plugin 'Maven Dependencies Postprocessor'
28-Mar-2019 11:28:36 All post build plugins have finished
28-Mar-2019 11:28:36 Generating build results summary...
28-Mar-2019 11:28:36 Saving build results to disk...
28-Mar-2019 11:28:36 Logging substituted variables...
28-Mar-2019 11:28:36 Indexing build results...
28-Mar-2019 11:28:36 Finished building AMQP-B15X-JOB1-43.