Gary sonar branch

Build: #53 failed Rebuilt by Gary Russell

Build result summary

Details

Completed
Duration
14 minutes
Labels
None
Agent
bamboo-20.af.pivotal.io
Revision
4f0203cb05e5bf1204bf52d5af8acd1825f34dbe 4f0203cb05e5bf1204bf52d5af8acd1825f34dbe
Failing since
#52 (Rebuilt by Gary Russell)
Fixed in
#56 (Manual run by Gary Russell)
Number of retries
1
No failed test found. A possible compilation error occurred.

Responsible

Code commits

Author Commit Message Commit date
Gary Russell <grussell@vmware.com> Gary Russell <grussell@vmware.com> 4f0203cb05e5bf1204bf52d5af8acd1825f34dbe m 4f0203cb05e5bf1204bf52d5af8acd1825f34dbe Revert sonar
Gary Russell <grussell@vmware.com> Gary Russell <grussell@vmware.com> b150e74066f9fc95260c68f8b38ecd409cd8f330 m b150e74066f9fc95260c68f8b38ecd409cd8f330 More diagnostics
Gary Russell <grussell@vmware.com> Gary Russell <grussell@vmware.com> dcc935473b098cf943dd87885c0911ac411b4268 m dcc935473b098cf943dd87885c0911ac411b4268 Add diagnostics for flaky test

Error summary for Default Job

The job generated some errors, drill down into the full build log for more details.

*** java.lang.instrument ASSERTION FAILED ***: "!errorOutstanding" with message can't create byte arrau at JPLISAgent.c line: 813

Exception: java.lang.OutOfMemoryError thrown from the UncaughtExceptionHandler in thread "org.springframework.amqp.rabbit.RabbitListenerEndpointContainer#12-1"

FAILURE: Build failed with an exception.

* What went wrong:
Execution failed for task ':spring-rabbit:test'.
> There were failing tests. See the report at: file:///opt/bamboo-home/xml-data/build-dir/AMQP-GAR-JOB1/spring-rabbit/build/reports/tests/test/index.html

* Try:
Run with --stacktrace option to get the stack trace. Run with --debug option to get more log output. Run with --scan to get full insights.

* Get more help at https://help.gradle.org

BUILD FAILED in 13m 44s