Integration tests inclusing RabbitMQ broker

Build: #459 failed Scheduled

Build result summary

Details

Completed
Duration
7 minutes
Labels
None
Agent
linux64-01-local
Revision
37952790a880a28b646d026aad336d1925a2c0ea 37952790a880a28b646d026aad336d1925a2c0ea
Total tests
340
Failing since
#454 (Scheduled – )

Tests

New test failures 13
Status Test View job Duration
Collapse Failed RabbitTemplatePerformanceIntegrationTests testSendAndReceiveExternalTransacted History
Default Job 18 secs
java.util.concurrent.ExecutionException: java.lang.IllegalStateException: Failed on iteration: 712
	at java.util.concurrent.FutureTask$Sync.innerGet(FutureTask.java:205)
	at java.util.concurrent.FutureTask.get(FutureTask.java:80)
	at org.springframework.amqp.rabbit.test.RepeatProcessor$2.evaluate(RepeatProcessor.java:123)
	at org.springframework.amqp.rabbit.test.Log4jLevelAdjuster$1.evaluate(Log4jLevelAdjuster.java:46)
	at org.junit.rules.TestWatchman$1.evaluate(TestWatchman.java:48)
	at org.junit.runners.BlockJUnit4ClassRunner.runNotIgnored(BlockJUnit4ClassRunner.java:79)
	at org.junit.runners.BlockJUnit4ClassRunner.runChild(BlockJUnit4ClassRunner.java:71)
(70 more lines...)
Collapse Failed MessageListenerContainerErrorHandlerIntegrationTests testErrorHandlerInvokeRuntimeExceptionFromPojo History
Default Job < 1 sec
java.lang.AssertionError: Expected to receive all messages before stop
	at org.junit.Assert.fail(Assert.java:91)
	at org.junit.Assert.assertTrue(Assert.java:43)
	at org.springframework.amqp.rabbit.listener.MessageListenerContainerErrorHandlerIntegrationTests.doTest(MessageListenerContainerErrorHandlerIntegrationTests.java:148)
	at org.springframework.amqp.rabbit.listener.MessageListenerContainerErrorHandlerIntegrationTests.testErrorHandlerInvokeRuntimeExceptionFromPojo(MessageListenerContainerErrorHandlerIntegrationTests.java:72)
	at sun.reflect.NativeMethodAccessorImpl.invoke0(Native Method)
	at sun.reflect.NativeMethodAccessorImpl.invoke(NativeMethodAccessorImpl.java:39)
	at sun.reflect.DelegatingMethodAccessorImpl.invoke(DelegatingMethodAccessorImpl.java:25)
(27 more lines...)
Collapse Failed MessageListenerContainerLifecycleIntegrationTests testTransactionalHighLevelWithPrefetch History
Default Job 27 secs
java.lang.AssertionError: Timed out waiting for message
	at org.junit.Assert.fail(Assert.java:91)
	at org.junit.Assert.assertTrue(Assert.java:43)
	at org.springframework.amqp.rabbit.listener.MessageListenerContainerLifecycleIntegrationTests.doTest(MessageListenerContainerLifecycleIntegrationTests.java:196)
	at org.springframework.amqp.rabbit.listener.MessageListenerContainerLifecycleIntegrationTests.testTransactionalHighLevelWithPrefetch(MessageListenerContainerLifecycleIntegrationTests.java:112)
	at sun.reflect.NativeMethodAccessorImpl.invoke0(Native Method)
	at sun.reflect.NativeMethodAccessorImpl.invoke(NativeMethodAccessorImpl.java:39)
	at sun.reflect.DelegatingMethodAccessorImpl.invoke(DelegatingMethodAccessorImpl.java:25)
(26 more lines...)
Collapse Failed MessageListenerContainerRetryIntegrationTests testStatefulRetryWithTxSizeAndIntermittentFailure History
Default Job 1 sec
java.lang.IllegalStateException: Failed on iteration: 1 of 10 (started at 0)
	at org.springframework.amqp.rabbit.test.RepeatProcessor$1.evaluate(RepeatProcessor.java:92)
	at org.junit.runners.BlockJUnit4ClassRunner.runNotIgnored(BlockJUnit4ClassRunner.java:79)
	at org.junit.runners.BlockJUnit4ClassRunner.runChild(BlockJUnit4ClassRunner.java:71)
	at org.junit.runners.BlockJUnit4ClassRunner.runChild(BlockJUnit4ClassRunner.java:49)
	at org.junit.runners.ParentRunner$3.run(ParentRunner.java:193)
	at org.junit.runners.ParentRunner$1.schedule(ParentRunner.java:52)
	at org.junit.runners.ParentRunner.runChildren(ParentRunner.java:191)
(36 more lines...)
Collapse Failed MessageListenerTxSizeIntegrationTests testListenerTransactionalSunnyDay History
Default Job 5 secs
java.lang.AssertionError: Timed out waiting for message
	at org.junit.Assert.fail(Assert.java:91)
	at org.junit.Assert.assertTrue(Assert.java:43)
	at org.springframework.amqp.rabbit.listener.MessageListenerTxSizeIntegrationTests.testListenerTransactionalSunnyDay(MessageListenerTxSizeIntegrationTests.java:83)
	at sun.reflect.NativeMethodAccessorImpl.invoke0(Native Method)
	at sun.reflect.NativeMethodAccessorImpl.invoke(NativeMethodAccessorImpl.java:39)
	at sun.reflect.DelegatingMethodAccessorImpl.invoke(DelegatingMethodAccessorImpl.java:25)
	at java.lang.reflect.Method.invoke(Method.java:592)
(27 more lines...)
Collapse Failed SimpleMessageListenerContainerIntegrationTests testListenerWithException[2] History
Default Job 1 sec
java.lang.AssertionError: 
	at org.junit.Assert.fail(Assert.java:91)
	at org.junit.Assert.assertTrue(Assert.java:43)
	at org.junit.Assert.assertNotNull(Assert.java:524)
	at org.junit.Assert.assertNotNull(Assert.java:535)
	at org.springframework.amqp.rabbit.listener.SimpleMessageListenerContainerIntegrationTests.doListenerWithExceptionTest(SimpleMessageListenerContainerIntegrationTests.java:214)
	at org.springframework.amqp.rabbit.listener.SimpleMessageListenerContainerIntegrationTests.testListenerWithException(SimpleMessageListenerContainerIntegrationTests.java:172)
	at sun.reflect.NativeMethodAccessorImpl.invoke0(Native Method)
(39 more lines...)
Collapse Failed SimpleMessageListenerContainerIntegrationTests testListenerWithException[6] History
Default Job 7 secs
java.lang.AssertionError: Timed out waiting for message
	at org.junit.Assert.fail(Assert.java:91)
	at org.junit.Assert.assertTrue(Assert.java:43)
	at org.springframework.amqp.rabbit.listener.SimpleMessageListenerContainerIntegrationTests.doListenerWithExceptionTest(SimpleMessageListenerContainerIntegrationTests.java:205)
	at org.springframework.amqp.rabbit.listener.SimpleMessageListenerContainerIntegrationTests.testListenerWithException(SimpleMessageListenerContainerIntegrationTests.java:172)
	at sun.reflect.NativeMethodAccessorImpl.invoke0(Native Method)
	at sun.reflect.NativeMethodAccessorImpl.invoke(NativeMethodAccessorImpl.java:39)
	at sun.reflect.DelegatingMethodAccessorImpl.invoke(DelegatingMethodAccessorImpl.java:25)
(37 more lines...)
Collapse Failed SimpleMessageListenerContainerIntegrationTests testListenerWithException[9] History
Default Job 36 secs
java.lang.AssertionError: Timed out waiting for message
	at org.junit.Assert.fail(Assert.java:91)
	at org.junit.Assert.assertTrue(Assert.java:43)
	at org.springframework.amqp.rabbit.listener.SimpleMessageListenerContainerIntegrationTests.doListenerWithExceptionTest(SimpleMessageListenerContainerIntegrationTests.java:205)
	at org.springframework.amqp.rabbit.listener.SimpleMessageListenerContainerIntegrationTests.testListenerWithException(SimpleMessageListenerContainerIntegrationTests.java:172)
	at sun.reflect.NativeMethodAccessorImpl.invoke0(Native Method)
	at sun.reflect.NativeMethodAccessorImpl.invoke(NativeMethodAccessorImpl.java:39)
	at sun.reflect.DelegatingMethodAccessorImpl.invoke(DelegatingMethodAccessorImpl.java:25)
(37 more lines...)
Collapse Failed SimpleMessageListenerContainerIntegrationTests testChannelAwareListenerWithException[2] History
Default Job 2 secs
java.lang.AssertionError: 
	at org.junit.Assert.fail(Assert.java:91)
	at org.junit.Assert.assertTrue(Assert.java:43)
	at org.junit.Assert.assertNotNull(Assert.java:524)
	at org.junit.Assert.assertNotNull(Assert.java:535)
	at org.springframework.amqp.rabbit.listener.SimpleMessageListenerContainerIntegrationTests.doListenerWithExceptionTest(SimpleMessageListenerContainerIntegrationTests.java:214)
	at org.springframework.amqp.rabbit.listener.SimpleMessageListenerContainerIntegrationTests.testChannelAwareListenerWithException(SimpleMessageListenerContainerIntegrationTests.java:178)
	at sun.reflect.NativeMethodAccessorImpl.invoke0(Native Method)
(39 more lines...)
Collapse Failed SimpleMessageListenerContainerIntegrationTests testChannelAwareListenerWithException[8] History
Default Job 1 sec
java.lang.AssertionError: 
	at org.junit.Assert.fail(Assert.java:91)
	at org.junit.Assert.assertTrue(Assert.java:43)
	at org.junit.Assert.assertNull(Assert.java:549)
	at org.junit.Assert.assertNull(Assert.java:560)
	at org.springframework.amqp.rabbit.listener.SimpleMessageListenerContainerIntegrationTests.doListenerWithExceptionTest(SimpleMessageListenerContainerIntegrationTests.java:216)
	at org.springframework.amqp.rabbit.listener.SimpleMessageListenerContainerIntegrationTests.testChannelAwareListenerWithException(SimpleMessageListenerContainerIntegrationTests.java:178)
	at sun.reflect.NativeMethodAccessorImpl.invoke0(Native Method)
(39 more lines...)
Collapse Failed SimpleMessageListenerContainerIntegrationTests testPojoListenerWithException[2] History
Default Job < 1 sec
java.lang.AssertionError: 
	at org.junit.Assert.fail(Assert.java:91)
	at org.junit.Assert.assertTrue(Assert.java:43)
	at org.junit.Assert.assertNotNull(Assert.java:524)
	at org.junit.Assert.assertNotNull(Assert.java:535)
	at org.springframework.amqp.rabbit.listener.SimpleMessageListenerContainerIntegrationTests.doListenerWithExceptionTest(SimpleMessageListenerContainerIntegrationTests.java:214)
	at org.springframework.amqp.rabbit.listener.SimpleMessageListenerContainerIntegrationTests.testPojoListenerWithException(SimpleMessageListenerContainerIntegrationTests.java:166)
	at sun.reflect.NativeMethodAccessorImpl.invoke0(Native Method)
(39 more lines...)
Collapse Failed SimpleMessageListenerContainerIntegrationTests testListenerSunnyDay[9] History
Default Job 16 secs
java.lang.AssertionError: Timed out waiting for message
	at org.junit.Assert.fail(Assert.java:91)
	at org.junit.Assert.assertTrue(Assert.java:43)
	at org.springframework.amqp.rabbit.listener.SimpleMessageListenerContainerIntegrationTests.doSunnyDayTest(SimpleMessageListenerContainerIntegrationTests.java:187)
	at org.springframework.amqp.rabbit.listener.SimpleMessageListenerContainerIntegrationTests.testListenerSunnyDay(SimpleMessageListenerContainerIntegrationTests.java:154)
	at sun.reflect.NativeMethodAccessorImpl.invoke0(Native Method)
	at sun.reflect.NativeMethodAccessorImpl.invoke(NativeMethodAccessorImpl.java:39)
	at sun.reflect.DelegatingMethodAccessorImpl.invoke(DelegatingMethodAccessorImpl.java:25)
(37 more lines...)
Collapse Failed SimpleMessageListenerContainerIntegrationTests testChannelAwareListenerWithException[7] History
Default Job 1 sec
java.lang.AssertionError: 
	at org.junit.Assert.fail(Assert.java:91)
	at org.junit.Assert.assertTrue(Assert.java:43)
	at org.junit.Assert.assertNotNull(Assert.java:524)
	at org.junit.Assert.assertNotNull(Assert.java:535)
	at org.springframework.amqp.rabbit.listener.SimpleMessageListenerContainerIntegrationTests.doListenerWithExceptionTest(SimpleMessageListenerContainerIntegrationTests.java:214)
	at org.springframework.amqp.rabbit.listener.SimpleMessageListenerContainerIntegrationTests.testChannelAwareListenerWithException(SimpleMessageListenerContainerIntegrationTests.java:178)
	at sun.reflect.NativeMethodAccessorImpl.invoke0(Native Method)
(39 more lines...)
Existing test failures 7
Status Test Failing since View job Duration
java.lang.AssertionError: Timed out waiting for message
	at org.junit.Assert.fail(Assert.java:91)
	at org.junit.Assert.assertTrue(Assert.java:43)
	at org.springframework.amqp.rabbit.listener.MessageListenerContainerLifecycleIntegrationTests.doTest(MessageListenerContainerLifecycleIntegrationTests.java:196)
	at org.springframework.amqp.rabbit.listener.MessageListenerContainerLifecycleIntegrationTests.testTransactionalHighLevel(MessageListenerContainerLifecycleIntegrationTests.java:102)
	at sun.reflect.NativeMethodAccessorImpl.invoke0(Native Method)
	at sun.reflect.NativeMethodAccessorImpl.invoke(NativeMethodAccessorImpl.java:39)
	at sun.reflect.DelegatingMethodAccessorImpl.invoke(DelegatingMethodAccessorImpl.java:25)
(26 more lines...)
java.lang.AssertionError: 
	at org.junit.Assert.fail(Assert.java:91)
	at org.junit.Assert.assertTrue(Assert.java:43)
	at org.junit.Assert.assertNotNull(Assert.java:524)
	at org.junit.Assert.assertNotNull(Assert.java:535)
	at org.springframework.amqp.rabbit.listener.SimpleMessageListenerContainerIntegrationTests.doListenerWithExceptionTest(SimpleMessageListenerContainerIntegrationTests.java:214)
	at org.springframework.amqp.rabbit.listener.SimpleMessageListenerContainerIntegrationTests.testListenerWithException(SimpleMessageListenerContainerIntegrationTests.java:172)
	at sun.reflect.NativeMethodAccessorImpl.invoke0(Native Method)
(39 more lines...)
java.lang.AssertionError: 
	at org.junit.Assert.fail(Assert.java:91)
	at org.junit.Assert.assertTrue(Assert.java:43)
	at org.junit.Assert.assertNotNull(Assert.java:524)
	at org.junit.Assert.assertNotNull(Assert.java:535)
	at org.springframework.amqp.rabbit.listener.SimpleMessageListenerContainerIntegrationTests.doListenerWithExceptionTest(SimpleMessageListenerContainerIntegrationTests.java:214)
	at org.springframework.amqp.rabbit.listener.SimpleMessageListenerContainerIntegrationTests.testChannelAwareListenerWithException(SimpleMessageListenerContainerIntegrationTests.java:178)
	at sun.reflect.NativeMethodAccessorImpl.invoke0(Native Method)
(39 more lines...)
java.lang.AssertionError: Timed out waiting for message
	at org.junit.Assert.fail(Assert.java:91)
	at org.junit.Assert.assertTrue(Assert.java:43)
	at org.springframework.amqp.rabbit.listener.SimpleMessageListenerContainerIntegrationTests.doSunnyDayTest(SimpleMessageListenerContainerIntegrationTests.java:187)
	at org.springframework.amqp.rabbit.listener.SimpleMessageListenerContainerIntegrationTests.testChannelAwareListenerSunnyDay(SimpleMessageListenerContainerIntegrationTests.java:160)
	at sun.reflect.NativeMethodAccessorImpl.invoke0(Native Method)
	at sun.reflect.NativeMethodAccessorImpl.invoke(NativeMethodAccessorImpl.java:39)
	at sun.reflect.DelegatingMethodAccessorImpl.invoke(DelegatingMethodAccessorImpl.java:25)
(37 more lines...)
java.lang.AssertionError: 
	at org.junit.Assert.fail(Assert.java:91)
	at org.junit.Assert.assertTrue(Assert.java:43)
	at org.junit.Assert.assertNotNull(Assert.java:524)
	at org.junit.Assert.assertNotNull(Assert.java:535)
	at org.springframework.amqp.rabbit.listener.SimpleMessageListenerContainerIntegrationTests.doListenerWithExceptionTest(SimpleMessageListenerContainerIntegrationTests.java:214)
	at org.springframework.amqp.rabbit.listener.SimpleMessageListenerContainerIntegrationTests.testPojoListenerWithException(SimpleMessageListenerContainerIntegrationTests.java:166)
	at sun.reflect.NativeMethodAccessorImpl.invoke0(Native Method)
(39 more lines...)
java.lang.AssertionError: 
	at org.junit.Assert.fail(Assert.java:91)
	at org.junit.Assert.assertTrue(Assert.java:43)
	at org.junit.Assert.assertNotNull(Assert.java:524)
	at org.junit.Assert.assertNotNull(Assert.java:535)
	at org.springframework.amqp.rabbit.listener.SimpleMessageListenerContainerIntegrationTests.doListenerWithExceptionTest(SimpleMessageListenerContainerIntegrationTests.java:214)
	at org.springframework.amqp.rabbit.listener.SimpleMessageListenerContainerIntegrationTests.testPojoListenerWithException(SimpleMessageListenerContainerIntegrationTests.java:166)
	at sun.reflect.NativeMethodAccessorImpl.invoke0(Native Method)
(39 more lines...)
java.lang.AssertionError: 
	at org.junit.Assert.fail(Assert.java:91)
	at org.junit.Assert.assertTrue(Assert.java:43)
	at org.junit.Assert.assertNotNull(Assert.java:524)
	at org.junit.Assert.assertNotNull(Assert.java:535)
	at org.springframework.amqp.rabbit.listener.SimpleMessageListenerContainerIntegrationTests.doListenerWithExceptionTest(SimpleMessageListenerContainerIntegrationTests.java:214)
	at org.springframework.amqp.rabbit.listener.SimpleMessageListenerContainerIntegrationTests.testChannelAwareListenerWithException(SimpleMessageListenerContainerIntegrationTests.java:178)
	at sun.reflect.NativeMethodAccessorImpl.invoke0(Native Method)
(39 more lines...)
Fixed tests 7
Status Test Failing since View job Duration
Successful RabbitTemplatePublisherCallbacksIntegrationTests testPublisherConfirmReceivedTwoTemplates History
Failing since build #458 (Scheduled) Default Job < 1 sec
Successful MessageListenerContainerLifecycleIntegrationTests testTransactionalLowLevelWithPrefetch History
Failing since build #458 (Scheduled) Default Job 3 secs
Successful MessageListenerRecoveryCachingConnectionIntegrationTests testListenerRecoversFromBogusDoubleAck History
Failing since build #458 (Scheduled) Default Job 1 sec
Successful SimpleMessageListenerContainerIntegrationTests testPojoListenerSunnyDay[9] History
Failing since build #457 (Scheduled) Default Job 1 sec
Successful SimpleMessageListenerContainerIntegrationTests testPojoListenerWithException[11] History
Failing since build #458 (Scheduled) Default Job 1 sec
Successful SimpleMessageListenerContainerIntegrationTests testPojoListenerWithException[3] History
Failing since build #458 (Scheduled) Default Job < 1 sec
Successful SimpleMessageListenerContainerIntegrationTests testListenerWithException[7] History
Failing since build #455 (Scheduled) Default Job < 1 sec