NIghtly build, all tests, JDK8

Build: #1247 failed Scheduled with changes by Gary Russell

Test results

  • 1,012 tests in total
  • 1 test failed
  • 1 failure is new
  • 10 tests were quarantined / skipped
  • 5 minutes taken in total.
New test failures 1
Status Test View job Duration
Collapse Failed SimpleMessageListenerContainerIntegration2Tests testDeleteOneQueue History
Default Job 3 secs
java.lang.AssertionError: java.lang.AssertionError: 
Expected: <8>
     but: was <7>
java.lang.AssertionError: 
Expected: <8>
     but: was <7>
	at org.hamcrest.MatcherAssert.assertThat(MatcherAssert.java:20)
	at org.junit.Assert.assertThat(Assert.java:956)
(51 more lines...)
Skipped tests 10
Status Test Failing since View job
Skipped RabbitListenerAnnotationBeanPostProcessorTests concurrency History
Default Job
Skipped MismatchedQueueDeclarationTests testAdminFailsWithMismatchedQueue History
Default Job
Skipped CachingConnectionFactoryIntegrationTests hangOnClose History
Default Job
Skipped CachingConnectionFactoryTests testReturnsNormalCloseDeferredClose History
Default Job
Skipped RabbitReconnectProblemTests surviveAReconnect History
Default Job
Skipped SSLConnectionTests test History
Default Job
Skipped RabbitAdminIntegrationTests testDeclareDelayedExchange History
Default Job
Skipped SimpleBatchStrategyTests testBatchingPerf History
Default Job
Skipped UnackedRawIntegrationTests testFourPublishUnackedRequeued History
Default Job
Skipped UnackedRawIntegrationTests testOnePublishUnackedRequeued History
Default Job