NIghtly build, all tests, JDK8

Build: #2032 failed Scheduled

Build result summary

Details

Completed
Duration
5 minutes
Labels
None
Agent
bamboo-24.af.pivotal.io
Revision
7d90ece6b6d42bfaff6a686e57fe6cdf1223967c 7d90ece6b6d42bfaff6a686e57fe6cdf1223967c
Total tests
1155
Fixed in
#2033 (Scheduled)

Tests

Responsible

No one has taken responsibility for this failure

Tests

New test failures 1
Status Test View job Duration
Collapse Failed RabbitTemplateIntegrationTests testReceiveTimeoutRequeue History
Default Job < 1 sec
org.springframework.amqp.rabbit.core.ConsumeOkNotReceivedException: org.springframework.amqp.rabbit.core.ConsumeOkNotReceivedException: Blocking receive, consumer failed to consume: TemplateConsumer [channel=Cached Rabbit Channel: PublisherCallbackChannelImpl: AMQChannel(amqp://guest@127.0.0.1:5672/,1), conn: Proxy@4e84a4cc Shared Rabbit Connection: SimpleConnection@65aae6f7 [delegate=amqp://guest@127.0.0.1:5672/, localPort= 39386], consumerTag=amq.ctag-CgqBk3yE0QDN08CGizhXBg]
org.springframework.amqp.rabbit.core.ConsumeOkNotReceivedException: Blocking receive, consumer failed to consume: TemplateConsumer [channel=Cached Rabbit Channel: PublisherCallbackChannelImpl: AMQChannel(amqp://guest@127.0.0.1:5672/,1), conn: Proxy@4e84a4cc Shared Rabbit Connection: SimpleConnection@65aae6f7 [delegate=amqp://guest@127.0.0.1:5672/, localPort= 39386], consumerTag=amq.ctag-CgqBk3yE0QDN08CGizhXBg]
	at org.springframework.amqp.rabbit.core.RabbitTemplate.createConsumer(RabbitTemplate.java:2330)
	at org.springframework.amqp.rabbit.core.RabbitTemplate.consumeDelivery(RabbitTemplate.java:1217)
	at org.springframework.amqp.rabbit.core.RabbitTemplate.lambda$receive$5(RabbitTemplate.java:1046)
	at org.springframework.amqp.rabbit.core.RabbitTemplate.doExecute(RabbitTemplate.java:1875)
	at org.springframework.amqp.rabbit.core.RabbitTemplate.execute(RabbitTemplate.java:1818)
	at org.springframework.amqp.rabbit.core.RabbitTemplate.execute(RabbitTemplate.java:1799)
(81 more lines...)