NIghtly build, all tests, JDK8

Build: #1247 failed

Job: Default Job failed

Stages & jobs

  1. Default Stage

Job result summary

Completed
Duration
6 minutes
Agent
bamboo-13.af.pivotal.io
Revision
1d4b99c4bcad5a8ebcf569270d545b112af01cc1 1d4b99c4bcad5a8ebcf569270d545b112af01cc1
Total tests
1012
Fixed in
#1248 (Scheduled)

Tests

  • 1,012 tests in total
  • 1 test failed
  • 1 failure is new
  • 10 tests were quarantined / skipped
  • 5 minutes taken in total.
New test failures 1
Status Test Duration
Collapse Failed SimpleMessageListenerContainerIntegration2Tests testDeleteOneQueue History
3 secs
java.lang.AssertionError: java.lang.AssertionError: 
Expected: <8>
     but: was <7>
java.lang.AssertionError: 
Expected: <8>
     but: was <7>
	at org.hamcrest.MatcherAssert.assertThat(MatcherAssert.java:20)
	at org.junit.Assert.assertThat(Assert.java:956)
(51 more lines...)

Error summary

The build generated some errors. See the full build log for more details.


867 tests completed, 1 failed, 10 skipped

FAILURE: Build failed with an exception.

* What went wrong:
Execution failed for task ':spring-rabbit:springIoJdk8Test'.
> There were failing tests. See the report at: file:///opt/bamboo-home/xml-data/build-dir/AMQP-MEIGHT-JOB1/spring-rabbit/build/reports/spring-io-jdk8-tests/index.html

* Try:
Run with --stacktrace option to get the stack trace. Run with --info or --debug option to get more log output.

* Get more help at https://help.gradle.org

BUILD FAILED in 6m 53s