2.2.x Maintenance

Build: #94 failed Changes by Gary Russell

Build result summary

Details

Completed
Duration
1 minute
Labels
None
Agent
bamboo-32.spring.vmware.com
Revision
e481891b3f018e2dd57c783a76ab58c621fc4282 e481891b3f018e2dd57c783a76ab58c621fc4282
Total tests
159
Fixed in
#95 (Changes by Artem Bilan)
No failed test found. A possible compilation error occurred.

Tests

  • 0 New failures
  • 0 Existing failures
  • 0 Fixed

Responsible

No one has taken responsibility for this failure

Code commits

Author Commit Message Commit date
Gary Russell Gary Russell e481891b3f018e2dd57c783a76ab58c621fc4282 e481891b3f018e2dd57c783a76ab58c621fc4282 GH-1347: DMLC Ignored Authentication Failures
Resolves https://github.com/spring-projects/spring-amqp/issues/1347

Container starts and keeps trying to connect instead of honoring
the property.

**cherry-pick to 2.2.x**

# Conflicts:
#        spring-rabbit/src/test/java/org/springframework/amqp/rabbit/listener/DirectMessageListenerContainerIntegrationTests.java
#        src/reference/asciidoc/amqp.adoc

Jira issues

IssueDescriptionStatus
Unknown Issue TypeGH-1347Could not obtain issue details from Jira

Error summary for Default Job

The job generated some errors, drill down into the full build log for more details.

/opt/bamboo-home/xml-data/build-dir/AMQP-R22X-JOB1/spring-rabbit/src/test/java/org/springframework/amqp/rabbit/listener/DirectMessageListenerContainerIntegrationTests.java:21: error: package org.awaitility does not exist
import static org.awaitility.Awaitility.await;
                            ^
/opt/bamboo-home/xml-data/build-dir/AMQP-R22X-JOB1/spring-rabbit/src/test/java/org/springframework/amqp/rabbit/listener/DirectMessageListenerContainerIntegrationTests.java:21: error: static import only from classes and interfaces
import static org.awaitility.Awaitility.await;
^
2 errors

FAILURE: Build failed with an exception.

* What went wrong:
Execution failed for task ':spring-rabbit:compileTestJava'.
> Compilation failed; see the compiler error output for details.

* Try:
Run with --stacktrace option to get the stack trace. Run with --info or --debug option to get more log output. Run with --scan to get full insights.

* Get more help at https://help.gradle.org

BUILD FAILED in 1m 45s