2.3.x Maintenance

Build: #5 failed Changes by Gary Russell

Build result summary

Details

Completed
Duration
1 minute
Labels
None
Agent
bamboo-29.spring.vmware.com
Revision
7b9be95310fe792c84c12f66ef9591536580af8e 7b9be95310fe792c84c12f66ef9591536580af8e
Total tests
164
Fixed in
#6 (Changes by Gary Russell)
No failed test found. A possible compilation error occurred.

Tests

Responsible

No one has taken responsibility for this failure

Code commits

Author Commit Message Commit date
Gary Russell Gary Russell 7b9be95310fe792c84c12f66ef9591536580af8e 7b9be95310fe792c84c12f66ef9591536580af8e GH-1352: Spring Integration 5.5 Compatibility
Refactoring to allow Spring Integration 5.5 to be used with both
2.3.x and 2.4.x.

Jira issues

IssueDescriptionStatus
Unknown Issue TypeGH-1352Could not obtain issue details from Jira

Error summary for Default Job

The job generated some errors, drill down into the full build log for more details.

        at com.fasterxml.jackson.databind.ObjectMapper._readValue(ObjectMapper.java:4173)
        at com.fasterxml.jackson.databind.ObjectMapper.readValue(ObjectMapper.java:2467)
        at com.fasterxml.jackson.core.JsonParser.readValueAs(JsonParser.java:1765)
        at org.jfrog.build.client.ArtifactoryHttpClient.execute(ArtifactoryHttpClient.java:249)
        at org.jfrog.build.client.ArtifactoryHttpClient.upload(ArtifactoryHttpClient.java:236)
        at org.jfrog.build.extractor.clientConfiguration.client.ArtifactoryBuildInfoClient.uploadFile(ArtifactoryBuildInfoClient.java:692)
        at org.jfrog.build.extractor.clientConfiguration.client.ArtifactoryBuildInfoClient.doDeployArtifact(ArtifactoryBuildInfoClient.java:379)
        at org.jfrog.build.extractor.clientConfiguration.client.ArtifactoryBuildInfoClient.deployArtifact(ArtifactoryBuildInfoClient.java:367)
        at org.jfrog.build.extractor.clientConfiguration.client.ArtifactoryBuildInfoClient.deployArtifact(ArtifactoryBuildInfoClient.java:352)
        at org.jfrog.gradle.plugin.artifactory.task.DeployTask.deployArtifacts(DeployTask.java:295)
        at org.jfrog.gradle.plugin.artifactory.task.DeployTask.deployArtifacts(DeployTask.java:197)
        at org.jfrog.gradle.plugin.artifactory.task.DeployTask.lambda$null$1(DeployTask.java:97)
        at java.util.concurrent.CompletableFuture$AsyncRun.run(CompletableFuture.java:1640)
        at java.util.concurrent.ThreadPoolExecutor.runWorker(ThreadPoolExecutor.java:1149)
        at java.util.concurrent.ThreadPoolExecutor$Worker.run(ThreadPoolExecutor.java:624)
        at java.lang.Thread.run(Thread.java:748)
Failed while reading the response from: PUT https://repo.spring.io/libs-snapshot-local/org/springframework/amqp/spring-rabbit-test/2.3.10-SNAPSHOT/spring-rabbit-test-2.3.10-SNAPSHOT.pom;build.timestamp=1624474429169;build.name=Spring+AMQP+-+2.3.x+-+Default+Job;vcs.revision=7b9be95310fe792c84c12f66ef9591536580af8e;build.number=5 HTTP/1.1
com.fasterxml.jackson.databind.exc.UnrecognizedPropertyException: Unrecognized field "lastModified" (class org.jfrog.build.client.ArtifactoryUploadResponse), not marked as ignorable (12 known properties: "checksums", "size", "repo", "downloadUri", "path", "statusLine", "created", "errors", "uri", "mimeType", "createdBy", "originalChecksums"])
at [Source: (String)"{
  "repo" : "libs-snapshot-local",
  "path" : "/org/springframework/amqp/spring-rabbit-test/2.3.10-SNAPSHOT/spring-rabbit-test-2.3.10-20210623.185349-2.pom",
  "created" : "2021-06-23T18:55:44.026Z",
  "createdBy" : "buildmaster",
  "lastModified" : null,
  "modifiedBy" : null,
  "lastUpdated" : null,
  "properties" : null,
  "downloadUri" : "https://repo.spring.io/artifactory/libs-snapshot-local/org/springframework/amqp/spring-rabbit-test/2.3.10-SNAPSHOT/spring-rabbit-test-2.3.10-20210623.1853"[truncated 578 chars]; line: 6, column: 24] (through reference chain: org.jfrog.build.client.ArtifactoryUploadResponse["lastModified"])
        at com.fasterxml.jackson.databind.exc.UnrecognizedPropertyException.from(UnrecognizedPropertyException.java:61)
        at com.fasterxml.jackson.databind.DeserializationContext.handleUnknownProperty(DeserializationContext.java:840)
        at com.fasterxml.jackson.databind.deser.std.StdDeserializer.handleUnknownProperty(StdDeserializer.java:1192)
        at com.fasterxml.jackson.databind.deser.BeanDeserializerBase.handleUnknownProperty(BeanDeserializerBase.java:1592)
        at com.fasterxml.jackson.databind.deser.BeanDeserializerBase.handleUnknownVanilla(BeanDeserializerBase.java:1570)
        at com.fasterxml.jackson.databind.deser.BeanDeserializer.vanillaDeserialize(BeanDeserializer.java:294)
        at com.fasterxml.jackson.databind.deser.BeanDeserializer.deserialize(BeanDeserializer.java:151)
        at com.fasterxml.jackson.databind.ObjectMapper._readValue(ObjectMapper.java:4173)
        at com.fasterxml.jackson.databind.ObjectMapper.readValue(ObjectMapper.java:2467)
        at com.fasterxml.jackson.core.JsonParser.readValueAs(JsonParser.java:1765)
        at org.jfrog.build.client.ArtifactoryHttpClient.execute(ArtifactoryHttpClient.java:249)
        at org.jfrog.build.client.ArtifactoryHttpClient.upload(ArtifactoryHttpClient.java:236)
        at org.jfrog.build.extractor.clientConfiguration.client.ArtifactoryBuildInfoClient.uploadFile(ArtifactoryBuildInfoClient.java:692)
        at org.jfrog.build.extractor.clientConfiguration.client.ArtifactoryBuildInfoClient.doDeployArtifact(ArtifactoryBuildInfoClient.java:379)
        at org.jfrog.build.extractor.clientConfiguration.client.ArtifactoryBuildInfoClient.deployArtifact(ArtifactoryBuildInfoClient.java:367)
        at org.jfrog.build.extractor.clientConfiguration.client.ArtifactoryBuildInfoClient.deployArtifact(ArtifactoryBuildInfoClient.java:352)
        at org.jfrog.gradle.plugin.artifactory.task.DeployTask.deployArtifacts(DeployTask.java:295)
        at org.jfrog.gradle.plugin.artifactory.task.DeployTask.deployArtifacts(DeployTask.java:197)
        at org.jfrog.gradle.plugin.artifactory.task.DeployTask.lambda$null$1(DeployTask.java:97)
        at java.util.concurrent.CompletableFuture$AsyncRun.run(CompletableFuture.java:1640)
        at java.util.concurrent.ThreadPoolExecutor.runWorker(ThreadPoolExecutor.java:1149)
        at java.util.concurrent.ThreadPoolExecutor$Worker.run(ThreadPoolExecutor.java:624)
        at java.lang.Thread.run(Thread.java:748)
Failed while reading the response from: PUT https://repo.spring.io/libs-snapshot-local/org/springframework/amqp/spring-amqp/2.3.10-SNAPSHOT/spring-amqp-2.3.10-SNAPSHOT.pom;build.timestamp=1624474429169;build.name=Spring+AMQP+-+2.3.x+-+Default+Job;vcs.revision=7b9be95310fe792c84c12f66ef9591536580af8e;build.number=5 HTTP/1.1
com.fasterxml.jackson.databind.exc.UnrecognizedPropertyException: Unrecognized field "lastModified" (class org.jfrog.build.client.ArtifactoryUploadResponse), not marked as ignorable (12 known properties: "checksums", "size", "repo", "downloadUri", "path", "statusLine", "created", "errors", "uri", "mimeType", "createdBy", "originalChecksums"])
at [Source: (String)"{
  "repo" : "libs-snapshot-local",
  "path" : "/org/springframework/amqp/spring-amqp/2.3.10-SNAPSHOT/spring-amqp-2.3.10-20210623.185349-2.pom",
  "created" : "2021-06-23T18:55:44.342Z",
  "createdBy" : "buildmaster",
  "lastModified" : null,
  "modifiedBy" : null,
  "lastUpdated" : null,
  "properties" : null,
  "downloadUri" : "https://repo.spring.io/artifactory/libs-snapshot-local/org/springframework/amqp/spring-amqp/2.3.10-SNAPSHOT/spring-amqp-2.3.10-20210623.185349-2.pom",
  "remoteUrl" : n"[truncated 536 chars]; line: 6, column: 24] (through reference chain: org.jfrog.build.client.ArtifactoryUploadResponse["lastModified"])
        at com.fasterxml.jackson.databind.exc.UnrecognizedPropertyException.from(UnrecognizedPropertyException.java:61)
        at com.fasterxml.jackson.databind.DeserializationContext.handleUnknownProperty(DeserializationContext.java:840)
        at com.fasterxml.jackson.databind.deser.std.StdDeserializer.handleUnknownProperty(StdDeserializer.java:1192)
        at com.fasterxml.jackson.databind.deser.BeanDeserializerBase.handleUnknownProperty(BeanDeserializerBase.java:1592)
        at com.fasterxml.jackson.databind.deser.BeanDeserializerBase.handleUnknownVanilla(BeanDeserializerBase.java:1570)
        at com.fasterxml.jackson.databind.deser.BeanDeserializer.vanillaDeserialize(BeanDeserializer.java:294)
        at com.fasterxml.jackson.databind.deser.BeanDeserializer.deserialize(BeanDeserializer.java:151)
        at com.fasterxml.jackson.databind.ObjectMapper._readValue(ObjectMapper.java:4173)
        at com.fasterxml.jackson.databind.ObjectMapper.readValue(ObjectMapper.java:2467)
        at com.fasterxml.jackson.core.JsonParser.readValueAs(JsonParser.java:1765)
        at org.jfrog.build.client.ArtifactoryHttpClient.execute(ArtifactoryHttpClient.java:249)
        at org.jfrog.build.client.ArtifactoryHttpClient.upload(ArtifactoryHttpClient.java:236)
        at org.jfrog.build.extractor.clientConfiguration.client.ArtifactoryBuildInfoClient.uploadFile(ArtifactoryBuildInfoClient.java:692)
        at org.jfrog.build.extractor.clientConfiguration.client.ArtifactoryBuildInfoClient.doDeployArtifact(ArtifactoryBuildInfoClient.java:379)
        at org.jfrog.build.extractor.clientConfiguration.client.ArtifactoryBuildInfoClient.deployArtifact(ArtifactoryBuildInfoClient.java:367)
        at org.jfrog.build.extractor.clientConfiguration.client.ArtifactoryBuildInfoClient.deployArtifact(ArtifactoryBuildInfoClient.java:352)
        at org.jfrog.gradle.plugin.artifactory.task.DeployTask.deployArtifacts(DeployTask.java:295)
        at org.jfrog.gradle.plugin.artifactory.task.DeployTask.deployArtifacts(DeployTask.java:197)
        at org.jfrog.gradle.plugin.artifactory.task.DeployTask.lambda$null$1(DeployTask.java:97)
        at java.util.concurrent.CompletableFuture$AsyncRun.run(CompletableFuture.java:1640)
        at java.util.concurrent.ThreadPoolExecutor.runWorker(ThreadPoolExecutor.java:1149)
        at java.util.concurrent.ThreadPoolExecutor$Worker.run(ThreadPoolExecutor.java:624)
        at java.lang.Thread.run(Thread.java:748)

FAILURE: Build failed with an exception.

* What went wrong:
Execution failed for task ':spring-rabbit:compileTestJava'.
> Compilation failed; see the compiler error output for details.

* Try:
Run with --stacktrace option to get the stack trace. Run with --info or --debug option to get more log output. Run with --scan to get full insights.

* Get more help at https://help.gradle.org

BUILD FAILED in 1m 41s