Build: #108 failed Changes by Spring Operator <[email protected]>

Logs

The following logs have been generated by the jobs in this plan.
  • Expand all
  • Collapse all
Job Logs
Collapse Default Job Default Stage Download or View
26-Mar-2019 17:02:24 :spring-rabbit:compileTestJava
26-Mar-2019 17:02:24 :spring-rabbit:processTestResources
26-Mar-2019 17:02:24 :spring-rabbit:testClasses
26-Mar-2019 17:02:25 :spring-rabbit:checkstyleTest
26-Mar-2019 17:02:25 :spring-rabbit:checkTestConfigs
26-Mar-2019 17:03:54 :spring-rabbit:test
26-Mar-2019 17:03:54
26-Mar-2019 17:03:54 org.springframework.amqp.rabbit.core.RabbitManagementTemplateTests > testDeleteExchange FAILED
26-Mar-2019 17:03:54     org.springframework.web.client.HttpClientErrorException at RabbitManagementTemplateTests.java:214
26-Mar-2019 17:04:47
26-Mar-2019 17:04:47 578 tests completed, 1 failed, 9 skipped
26-Mar-2019 17:04:47 :spring-rabbit:test FAILED
26-Mar-2019 17:04:47
26-Mar-2019 17:04:47 FAILURE: Build failed with an exception.
26-Mar-2019 17:04:47
26-Mar-2019 17:04:47 * What went wrong:
26-Mar-2019 17:04:47 Execution failed for task ':spring-rabbit:test'.
26-Mar-2019 17:04:47
26-Mar-2019 17:04:47 BUILD FAILED
26-Mar-2019 17:04:47
26-Mar-2019 17:04:47 Total time: 3 mins 22.878 secs
26-Mar-2019 17:04:47 > There were failing tests. See the report at: file:///opt/bamboo-home/xml-data/build-dir/AMQP-SA16X-JOB1/spring-rabbit/build/reports/tests/index.html
26-Mar-2019 17:04:47
26-Mar-2019 17:04:47 * Try:
26-Mar-2019 17:04:47 Run with --stacktrace option to get the stack trace. Run with --info or --debug option to get more log output.