Build: #108 failed Changes by Spring Operator <[email protected]>

Test results

  • 732 tests in total
  • 1 test failed
  • 9 tests were quarantined / skipped
  • 2 minutes taken in total.
Existing test failures 1
Status Test Failing since View job Duration
org.springframework.web.client.HttpClientErrorException: org.springframework.web.client.HttpClientErrorException: 415 Unsupported Media Type
org.springframework.web.client.HttpClientErrorException: 415 Unsupported Media Type
	at org.springframework.web.client.DefaultResponseErrorHandler.handleError(DefaultResponseErrorHandler.java:91)
	at org.springframework.web.client.RestTemplate.handleResponse(RestTemplate.java:641)
	at org.springframework.web.client.RestTemplate.doExecute(RestTemplate.java:597)
	at org.springframework.web.client.RestTemplate.execute(RestTemplate.java:572)
	at org.springframework.web.client.RestTemplate.put(RestTemplate.java:421)
	at com.rabbitmq.http.client.Client.declareExchange(Client.java:261)
(47 more lines...)
Skipped tests 9
Status Test Failing since View job
Skipped RabbitListenerAnnotationBeanPostProcessorTests concurrency History
Default Job
Skipped MismatchedQueueDeclarationTests testAdminFailsWithMismatchedQueue History
Default Job
Skipped CachingConnectionFactoryIntegrationTests hangOnClose History
Default Job
Skipped RabbitReconnectProblemTests surviveAReconnect History
Default Job
Skipped SSLConnectionTests test History
Default Job
Skipped RabbitAdminIntegrationTests testDeclareDelayedExchange History
Default Job
Skipped SimpleBatchStrategyTests testBatchingPerf History
Default Job
Skipped UnackedRawIntegrationTests testFourPublishUnackedRequeued History
Default Job
Skipped UnackedRawIntegrationTests testOnePublishUnackedRequeued History
Default Job