Sonar Build (Master) - https://sonar.spring.io/dashboard/index/org.springframework.amqp:spring-amqp-dist

Build: #3329 failed Scheduled with changes by Gary Russell <[email protected]>

Build result summary

Details

Completed
Duration
52 seconds
Labels
None
Agent
bamboo-36.spring.vmware.com
Revision
c77827a688589b06a05e8722867bc8eb9ab65e5c c77827a688589b06a05e8722867bc8eb9ab65e5c
Fixed in
#3333 (Manual run by Gary Russell)
No failed test found. A possible compilation error occurred.

Responsible

No one has taken responsibility for this failure

Code commits

Author Commit Message Commit date
Gary Russell <grussell@vmware.com> Gary Russell <[email protected]> c77827a688589b06a05e8722867bc8eb9ab65e5c c77827a688589b06a05e8722867bc8eb9ab65e5c GH-1352: Fix Sonar Issues
Gary Russell <grussell@vmware.com> Gary Russell <[email protected]> c229b2d5874db86f1a655bf652793a8a3b954139 c229b2d5874db86f1a655bf652793a8a3b954139 GH-1352: Add package-info with NonNullApi Annot.

Jira issues

IssueDescriptionStatus
Unknown Issue TypeGH-1352Could not obtain issue details from Jira

Error summary for Default Job

The job generated some errors, drill down into the full build log for more details.

/opt/users/bamboo/.gradle/caches/modules-2/files-2.1/com.rabbitmq/http-client/3.9.0.RELEASE/6e7971cc456c3072ddf0c35f1175502fb878d3dc/http-client-3.9.0.RELEASE.jar(com/rabbitmq/http/client/domain/QueueInfo.class): warning: Cannot find annotation method 'value()' in type 'JsonIgnoreProperties': class file for com.fasterxml.jackson.annotation.JsonIgnoreProperties not found
/opt/users/bamboo/.gradle/caches/modules-2/files-2.1/com.rabbitmq/http-client/3.9.0.RELEASE/6e7971cc456c3072ddf0c35f1175502fb878d3dc/http-client-3.9.0.RELEASE.jar(com/rabbitmq/http/client/domain/QueueInfo.class): warning: Cannot find annotation method 'value()' in type 'JsonProperty': class file for com.fasterxml.jackson.annotation.JsonProperty not found
/opt/users/bamboo/.gradle/caches/modules-2/files-2.1/com.rabbitmq/http-client/3.9.0.RELEASE/6e7971cc456c3072ddf0c35f1175502fb878d3dc/http-client-3.9.0.RELEASE.jar(com/rabbitmq/http/client/domain/QueueInfo.class): warning: Cannot find annotation method 'value()' in type 'JsonProperty'
/opt/users/bamboo/.gradle/caches/modules-2/files-2.1/com.rabbitmq/http-client/3.9.0.RELEASE/6e7971cc456c3072ddf0c35f1175502fb878d3dc/http-client-3.9.0.RELEASE.jar(com/rabbitmq/http/client/domain/QueueInfo.class): warning: Cannot find annotation method 'value()' in type 'JsonProperty'
/opt/users/bamboo/.gradle/caches/modules-2/files-2.1/com.rabbitmq/http-client/3.9.0.RELEASE/6e7971cc456c3072ddf0c35f1175502fb878d3dc/http-client-3.9.0.RELEASE.jar(com/rabbitmq/http/client/domain/QueueInfo.class): warning: Cannot find annotation method 'value()' in type 'JsonProperty'
/opt/users/bamboo/.gradle/caches/modules-2/files-2.1/com.rabbitmq/http-client/3.9.0.RELEASE/6e7971cc456c3072ddf0c35f1175502fb878d3dc/http-client-3.9.0.RELEASE.jar(com/rabbitmq/http/client/domain/QueueInfo.class): warning: Cannot find annotation method 'value()' in type 'JsonProperty'
/opt/users/bamboo/.gradle/caches/modules-2/files-2.1/com.rabbitmq/http-client/3.9.0.RELEASE/6e7971cc456c3072ddf0c35f1175502fb878d3dc/http-client-3.9.0.RELEASE.jar(com/rabbitmq/http/client/domain/QueueInfo.class): warning: Cannot find annotation method 'value()' in type 'JsonProperty'
/opt/users/bamboo/.gradle/caches/modules-2/files-2.1/com.rabbitmq/http-client/3.9.0.RELEASE/6e7971cc456c3072ddf0c35f1175502fb878d3dc/http-client-3.9.0.RELEASE.jar(com/rabbitmq/http/client/domain/QueueInfo.class): warning: Cannot find annotation method 'value()' in type 'JsonProperty'
/opt/users/bamboo/.gradle/caches/modules-2/files-2.1/com.rabbitmq/http-client/3.9.0.RELEASE/6e7971cc456c3072ddf0c35f1175502fb878d3dc/http-client-3.9.0.RELEASE.jar(com/rabbitmq/http/client/domain/QueueInfo.class): warning: Cannot find annotation method 'value()' in type 'JsonProperty'
/opt/users/bamboo/.gradle/caches/modules-2/files-2.1/com.rabbitmq/http-client/3.9.0.RELEASE/6e7971cc456c3072ddf0c35f1175502fb878d3dc/http-client-3.9.0.RELEASE.jar(com/rabbitmq/http/client/domain/QueueInfo.class): warning: Cannot find annotation method 'value()' in type 'JsonProperty'
/opt/users/bamboo/.gradle/caches/modules-2/files-2.1/com.rabbitmq/http-client/3.9.0.RELEASE/6e7971cc456c3072ddf0c35f1175502fb878d3dc/http-client-3.9.0.RELEASE.jar(com/rabbitmq/http/client/domain/QueueInfo.class): warning: Cannot find annotation method 'value()' in type 'JsonProperty'
/opt/users/bamboo/.gradle/caches/modules-2/files-2.1/com.rabbitmq/http-client/3.9.0.RELEASE/6e7971cc456c3072ddf0c35f1175502fb878d3dc/http-client-3.9.0.RELEASE.jar(com/rabbitmq/http/client/domain/QueueInfo.class): warning: Cannot find annotation method 'value()' in type 'JsonProperty'
/opt/users/bamboo/.gradle/caches/modules-2/files-2.1/com.rabbitmq/http-client/3.9.0.RELEASE/6e7971cc456c3072ddf0c35f1175502fb878d3dc/http-client-3.9.0.RELEASE.jar(com/rabbitmq/http/client/domain/QueueInfo.class): warning: Cannot find annotation method 'value()' in type 'JsonProperty'
/opt/users/bamboo/.gradle/caches/modules-2/files-2.1/com.rabbitmq/http-client/3.9.0.RELEASE/6e7971cc456c3072ddf0c35f1175502fb878d3dc/http-client-3.9.0.RELEASE.jar(com/rabbitmq/http/client/domain/QueueInfo.class): warning: Cannot find annotation method 'value()' in type 'JsonProperty'
/opt/users/bamboo/.gradle/caches/modules-2/files-2.1/com.rabbitmq/http-client/3.9.0.RELEASE/6e7971cc456c3072ddf0c35f1175502fb878d3dc/http-client-3.9.0.RELEASE.jar(com/rabbitmq/http/client/domain/QueueInfo.class): warning: Cannot find annotation method 'value()' in type 'JsonProperty'
/opt/users/bamboo/.gradle/caches/modules-2/files-2.1/com.rabbitmq/http-client/3.9.0.RELEASE/6e7971cc456c3072ddf0c35f1175502fb878d3dc/http-client-3.9.0.RELEASE.jar(com/rabbitmq/http/client/domain/QueueInfo.class): warning: Cannot find annotation method 'value()' in type 'JsonProperty'
/opt/users/bamboo/.gradle/caches/modules-2/files-2.1/com.rabbitmq/http-client/3.9.0.RELEASE/6e7971cc456c3072ddf0c35f1175502fb878d3dc/http-client-3.9.0.RELEASE.jar(com/rabbitmq/http/client/domain/QueueInfo.class): warning: Cannot find annotation method 'value()' in type 'JsonProperty'
/opt/users/bamboo/.gradle/caches/modules-2/files-2.1/com.rabbitmq/http-client/3.9.0.RELEASE/6e7971cc456c3072ddf0c35f1175502fb878d3dc/http-client-3.9.0.RELEASE.jar(com/rabbitmq/http/client/domain/QueueInfo.class): warning: Cannot find annotation method 'value()' in type 'JsonProperty'
/opt/users/bamboo/.gradle/caches/modules-2/files-2.1/com.rabbitmq/http-client/3.9.0.RELEASE/6e7971cc456c3072ddf0c35f1175502fb878d3dc/http-client-3.9.0.RELEASE.jar(com/rabbitmq/http/client/domain/QueueInfo.class): warning: Cannot find annotation method 'value()' in type 'JsonProperty'
/opt/users/bamboo/.gradle/caches/modules-2/files-2.1/com.rabbitmq/http-client/3.9.0.RELEASE/6e7971cc456c3072ddf0c35f1175502fb878d3dc/http-client-3.9.0.RELEASE.jar(com/rabbitmq/http/client/domain/QueueInfo.class): warning: Cannot find annotation method 'value()' in type 'JsonProperty'
/opt/users/bamboo/.gradle/caches/modules-2/files-2.1/com.rabbitmq/http-client/3.9.0.RELEASE/6e7971cc456c3072ddf0c35f1175502fb878d3dc/http-client-3.9.0.RELEASE.jar(com/rabbitmq/http/client/domain/QueueInfo.class): warning: Cannot find annotation method 'value()' in type 'JsonProperty'
/opt/users/bamboo/.gradle/caches/modules-2/files-2.1/com.rabbitmq/http-client/3.9.0.RELEASE/6e7971cc456c3072ddf0c35f1175502fb878d3dc/http-client-3.9.0.RELEASE.jar(com/rabbitmq/http/client/domain/QueueInfo.class): warning: Cannot find annotation method 'value()' in type 'JsonProperty'
/opt/users/bamboo/.gradle/caches/modules-2/files-2.1/com.rabbitmq/http-client/3.9.0.RELEASE/6e7971cc456c3072ddf0c35f1175502fb878d3dc/http-client-3.9.0.RELEASE.jar(com/rabbitmq/http/client/domain/QueueInfo.class): warning: Cannot find annotation method 'value()' in type 'JsonProperty'
/opt/users/bamboo/.gradle/caches/modules-2/files-2.1/com.rabbitmq/http-client/3.9.0.RELEASE/6e7971cc456c3072ddf0c35f1175502fb878d3dc/http-client-3.9.0.RELEASE.jar(com/rabbitmq/http/client/domain/QueueInfo.class): warning: Cannot find annotation method 'value()' in type 'JsonProperty'
/opt/users/bamboo/.gradle/caches/modules-2/files-2.1/com.rabbitmq/http-client/3.9.0.RELEASE/6e7971cc456c3072ddf0c35f1175502fb878d3dc/http-client-3.9.0.RELEASE.jar(com/rabbitmq/http/client/domain/QueueInfo.class): warning: Cannot find annotation method 'value()' in type 'JsonProperty'
/opt/users/bamboo/.gradle/caches/modules-2/files-2.1/com.rabbitmq/http-client/3.9.0.RELEASE/6e7971cc456c3072ddf0c35f1175502fb878d3dc/http-client-3.9.0.RELEASE.jar(com/rabbitmq/http/client/domain/QueueInfo.class): warning: Cannot find annotation method 'value()' in type 'JsonProperty'
/opt/users/bamboo/.gradle/caches/modules-2/files-2.1/com.rabbitmq/http-client/3.9.0.RELEASE/6e7971cc456c3072ddf0c35f1175502fb878d3dc/http-client-3.9.0.RELEASE.jar(com/rabbitmq/http/client/domain/QueueInfo.class): warning: Cannot find annotation method 'value()' in type 'JsonProperty'
/opt/users/bamboo/.gradle/caches/modules-2/files-2.1/com.rabbitmq/http-client/3.9.0.RELEASE/6e7971cc456c3072ddf0c35f1175502fb878d3dc/http-client-3.9.0.RELEASE.jar(com/rabbitmq/http/client/domain/QueueInfo.class): warning: Cannot find annotation method 'value()' in type 'JsonProperty'
/opt/users/bamboo/.gradle/caches/modules-2/files-2.1/com.rabbitmq/http-client/3.9.0.RELEASE/6e7971cc456c3072ddf0c35f1175502fb878d3dc/http-client-3.9.0.RELEASE.jar(com/rabbitmq/http/client/domain/QueueInfo.class): warning: Cannot find annotation method 'value()' in type 'JsonProperty'
/opt/users/bamboo/.gradle/caches/modules-2/files-2.1/com.rabbitmq/http-client/3.9.0.RELEASE/6e7971cc456c3072ddf0c35f1175502fb878d3dc/http-client-3.9.0.RELEASE.jar(com/rabbitmq/http/client/domain/QueueInfo.class): warning: Cannot find annotation method 'value()' in type 'JsonProperty'
/opt/users/bamboo/.gradle/caches/modules-2/files-2.1/com.rabbitmq/http-client/3.9.0.RELEASE/6e7971cc456c3072ddf0c35f1175502fb878d3dc/http-client-3.9.0.RELEASE.jar(com/rabbitmq/http/client/domain/QueueInfo.class): warning: Cannot find annotation method 'value()' in type 'JsonProperty'
31 warnings
/opt/bamboo-home/xml-data/build-dir/AMQP-SONAR-JOB1/spring-rabbit-stream/src/test/java/org/springframework/rabbit/stream/listener/RabbitListenerTests.java:145: error: cannot find symbol
                                        .manualCommitStrategy());
                                        ^
  symbol:   method manualCommitStrategy()
  location: interface ConsumerBuilder
/opt/bamboo-home/xml-data/build-dir/AMQP-SONAR-JOB1/spring-rabbit-stream/src/test/java/org/springframework/rabbit/stream/listener/RabbitListenerTests.java:154: error: cannot find symbol
                        context.commit();
                               ^
  symbol:   method commit()
  location: variable context of type Context
2 errors
/opt/users/bamboo/.gradle/caches/modules-2/files-2.1/com.rabbitmq/http-client/3.9.0.RELEASE/6e7971cc456c3072ddf0c35f1175502fb878d3dc/http-client-3.9.0.RELEASE.jar(com/rabbitmq/http/client/domain/QueueInfo.class): warning: Cannot find annotation method 'value()' in type 'JsonIgnoreProperties': class file for com.fasterxml.jackson.annotation.JsonIgnoreProperties not found
/opt/users/bamboo/.gradle/caches/modules-2/files-2.1/com.rabbitmq/http-client/3.9.0.RELEASE/6e7971cc456c3072ddf0c35f1175502fb878d3dc/http-client-3.9.0.RELEASE.jar(com/rabbitmq/http/client/domain/QueueInfo.class): warning: Cannot find annotation method 'value()' in type 'JsonProperty': class file for com.fasterxml.jackson.annotation.JsonProperty not found
/opt/users/bamboo/.gradle/caches/modules-2/files-2.1/com.rabbitmq/http-client/3.9.0.RELEASE/6e7971cc456c3072ddf0c35f1175502fb878d3dc/http-client-3.9.0.RELEASE.jar(com/rabbitmq/http/client/domain/QueueInfo.class): warning: Cannot find annotation method 'value()' in type 'JsonProperty'
/opt/users/bamboo/.gradle/caches/modules-2/files-2.1/com.rabbitmq/http-client/3.9.0.RELEASE/6e7971cc456c3072ddf0c35f1175502fb878d3dc/http-client-3.9.0.RELEASE.jar(com/rabbitmq/http/client/domain/QueueInfo.class): warning: Cannot find annotation method 'value()' in type 'JsonProperty'
/opt/users/bamboo/.gradle/caches/modules-2/files-2.1/com.rabbitmq/http-client/3.9.0.RELEASE/6e7971cc456c3072ddf0c35f1175502fb878d3dc/http-client-3.9.0.RELEASE.jar(com/rabbitmq/http/client/domain/QueueInfo.class): warning: Cannot find annotation method 'value()' in type 'JsonProperty'
/opt/users/bamboo/.gradle/caches/modules-2/files-2.1/com.rabbitmq/http-client/3.9.0.RELEASE/6e7971cc456c3072ddf0c35f1175502fb878d3dc/http-client-3.9.0.RELEASE.jar(com/rabbitmq/http/client/domain/QueueInfo.class): warning: Cannot find annotation method 'value()' in type 'JsonProperty'
/opt/users/bamboo/.gradle/caches/modules-2/files-2.1/com.rabbitmq/http-client/3.9.0.RELEASE/6e7971cc456c3072ddf0c35f1175502fb878d3dc/http-client-3.9.0.RELEASE.jar(com/rabbitmq/http/client/domain/QueueInfo.class): warning: Cannot find annotation method 'value()' in type 'JsonProperty'
/opt/users/bamboo/.gradle/caches/modules-2/files-2.1/com.rabbitmq/http-client/3.9.0.RELEASE/6e7971cc456c3072ddf0c35f1175502fb878d3dc/http-client-3.9.0.RELEASE.jar(com/rabbitmq/http/client/domain/QueueInfo.class): warning: Cannot find annotation method 'value()' in type 'JsonProperty'
/opt/users/bamboo/.gradle/caches/modules-2/files-2.1/com.rabbitmq/http-client/3.9.0.RELEASE/6e7971cc456c3072ddf0c35f1175502fb878d3dc/http-client-3.9.0.RELEASE.jar(com/rabbitmq/http/client/domain/QueueInfo.class): warning: Cannot find annotation method 'value()' in type 'JsonProperty'
/opt/users/bamboo/.gradle/caches/modules-2/files-2.1/com.rabbitmq/http-client/3.9.0.RELEASE/6e7971cc456c3072ddf0c35f1175502fb878d3dc/http-client-3.9.0.RELEASE.jar(com/rabbitmq/http/client/domain/QueueInfo.class): warning: Cannot find annotation method 'value()' in type 'JsonProperty'
/opt/users/bamboo/.gradle/caches/modules-2/files-2.1/com.rabbitmq/http-client/3.9.0.RELEASE/6e7971cc456c3072ddf0c35f1175502fb878d3dc/http-client-3.9.0.RELEASE.jar(com/rabbitmq/http/client/domain/QueueInfo.class): warning: Cannot find annotation method 'value()' in type 'JsonProperty'
/opt/users/bamboo/.gradle/caches/modules-2/files-2.1/com.rabbitmq/http-client/3.9.0.RELEASE/6e7971cc456c3072ddf0c35f1175502fb878d3dc/http-client-3.9.0.RELEASE.jar(com/rabbitmq/http/client/domain/QueueInfo.class): warning: Cannot find annotation method 'value()' in type 'JsonProperty'
/opt/users/bamboo/.gradle/caches/modules-2/files-2.1/com.rabbitmq/http-client/3.9.0.RELEASE/6e7971cc456c3072ddf0c35f1175502fb878d3dc/http-client-3.9.0.RELEASE.jar(com/rabbitmq/http/client/domain/QueueInfo.class): warning: Cannot find annotation method 'value()' in type 'JsonProperty'
/opt/users/bamboo/.gradle/caches/modules-2/files-2.1/com.rabbitmq/http-client/3.9.0.RELEASE/6e7971cc456c3072ddf0c35f1175502fb878d3dc/http-client-3.9.0.RELEASE.jar(com/rabbitmq/http/client/domain/QueueInfo.class): warning: Cannot find annotation method 'value()' in type 'JsonProperty'
/opt/users/bamboo/.gradle/caches/modules-2/files-2.1/com.rabbitmq/http-client/3.9.0.RELEASE/6e7971cc456c3072ddf0c35f1175502fb878d3dc/http-client-3.9.0.RELEASE.jar(com/rabbitmq/http/client/domain/QueueInfo.class): warning: Cannot find annotation method 'value()' in type 'JsonProperty'
/opt/users/bamboo/.gradle/caches/modules-2/files-2.1/com.rabbitmq/http-client/3.9.0.RELEASE/6e7971cc456c3072ddf0c35f1175502fb878d3dc/http-client-3.9.0.RELEASE.jar(com/rabbitmq/http/client/domain/QueueInfo.class): warning: Cannot find annotation method 'value()' in type 'JsonProperty'
/opt/users/bamboo/.gradle/caches/modules-2/files-2.1/com.rabbitmq/http-client/3.9.0.RELEASE/6e7971cc456c3072ddf0c35f1175502fb878d3dc/http-client-3.9.0.RELEASE.jar(com/rabbitmq/http/client/domain/QueueInfo.class): warning: Cannot find annotation method 'value()' in type 'JsonProperty'
/opt/users/bamboo/.gradle/caches/modules-2/files-2.1/com.rabbitmq/http-client/3.9.0.RELEASE/6e7971cc456c3072ddf0c35f1175502fb878d3dc/http-client-3.9.0.RELEASE.jar(com/rabbitmq/http/client/domain/QueueInfo.class): warning: Cannot find annotation method 'value()' in type 'JsonProperty'
/opt/users/bamboo/.gradle/caches/modules-2/files-2.1/com.rabbitmq/http-client/3.9.0.RELEASE/6e7971cc456c3072ddf0c35f1175502fb878d3dc/http-client-3.9.0.RELEASE.jar(com/rabbitmq/http/client/domain/QueueInfo.class): warning: Cannot find annotation method 'value()' in type 'JsonProperty'
/opt/users/bamboo/.gradle/caches/modules-2/files-2.1/com.rabbitmq/http-client/3.9.0.RELEASE/6e7971cc456c3072ddf0c35f1175502fb878d3dc/http-client-3.9.0.RELEASE.jar(com/rabbitmq/http/client/domain/QueueInfo.class): warning: Cannot find annotation method 'value()' in type 'JsonProperty'
/opt/users/bamboo/.gradle/caches/modules-2/files-2.1/com.rabbitmq/http-client/3.9.0.RELEASE/6e7971cc456c3072ddf0c35f1175502fb878d3dc/http-client-3.9.0.RELEASE.jar(com/rabbitmq/http/client/domain/QueueInfo.class): warning: Cannot find annotation method 'value()' in type 'JsonProperty'
/opt/users/bamboo/.gradle/caches/modules-2/files-2.1/com.rabbitmq/http-client/3.9.0.RELEASE/6e7971cc456c3072ddf0c35f1175502fb878d3dc/http-client-3.9.0.RELEASE.jar(com/rabbitmq/http/client/domain/QueueInfo.class): warning: Cannot find annotation method 'value()' in type 'JsonProperty'
/opt/users/bamboo/.gradle/caches/modules-2/files-2.1/com.rabbitmq/http-client/3.9.0.RELEASE/6e7971cc456c3072ddf0c35f1175502fb878d3dc/http-client-3.9.0.RELEASE.jar(com/rabbitmq/http/client/domain/QueueInfo.class): warning: Cannot find annotation method 'value()' in type 'JsonProperty'
/opt/users/bamboo/.gradle/caches/modules-2/files-2.1/com.rabbitmq/http-client/3.9.0.RELEASE/6e7971cc456c3072ddf0c35f1175502fb878d3dc/http-client-3.9.0.RELEASE.jar(com/rabbitmq/http/client/domain/QueueInfo.class): warning: Cannot find annotation method 'value()' in type 'JsonProperty'
/opt/users/bamboo/.gradle/caches/modules-2/files-2.1/com.rabbitmq/http-client/3.9.0.RELEASE/6e7971cc456c3072ddf0c35f1175502fb878d3dc/http-client-3.9.0.RELEASE.jar(com/rabbitmq/http/client/domain/QueueInfo.class): warning: Cannot find annotation method 'value()' in type 'JsonProperty'
/opt/users/bamboo/.gradle/caches/modules-2/files-2.1/com.rabbitmq/http-client/3.9.0.RELEASE/6e7971cc456c3072ddf0c35f1175502fb878d3dc/http-client-3.9.0.RELEASE.jar(com/rabbitmq/http/client/domain/QueueInfo.class): warning: Cannot find annotation method 'value()' in type 'JsonProperty'
/opt/users/bamboo/.gradle/caches/modules-2/files-2.1/com.rabbitmq/http-client/3.9.0.RELEASE/6e7971cc456c3072ddf0c35f1175502fb878d3dc/http-client-3.9.0.RELEASE.jar(com/rabbitmq/http/client/domain/QueueInfo.class): warning: Cannot find annotation method 'value()' in type 'JsonProperty'
/opt/users/bamboo/.gradle/caches/modules-2/files-2.1/com.rabbitmq/http-client/3.9.0.RELEASE/6e7971cc456c3072ddf0c35f1175502fb878d3dc/http-client-3.9.0.RELEASE.jar(com/rabbitmq/http/client/domain/QueueInfo.class): warning: Cannot find annotation method 'value()' in type 'JsonProperty'
/opt/users/bamboo/.gradle/caches/modules-2/files-2.1/com.rabbitmq/http-client/3.9.0.RELEASE/6e7971cc456c3072ddf0c35f1175502fb878d3dc/http-client-3.9.0.RELEASE.jar(com/rabbitmq/http/client/domain/QueueInfo.class): warning: Cannot find annotation method 'value()' in type 'JsonProperty'
/opt/users/bamboo/.gradle/caches/modules-2/files-2.1/com.rabbitmq/http-client/3.9.0.RELEASE/6e7971cc456c3072ddf0c35f1175502fb878d3dc/http-client-3.9.0.RELEASE.jar(com/rabbitmq/http/client/domain/QueueInfo.class): warning: Cannot find annotation method 'value()' in type 'JsonProperty'
/opt/users/bamboo/.gradle/caches/modules-2/files-2.1/com.rabbitmq/http-client/3.9.0.RELEASE/6e7971cc456c3072ddf0c35f1175502fb878d3dc/http-client-3.9.0.RELEASE.jar(com/rabbitmq/http/client/domain/QueueInfo.class): warning: Cannot find annotation method 'value()' in type 'JsonProperty'
/opt/users/bamboo/.gradle/caches/modules-2/files-2.1/com.rabbitmq/http-client/3.9.0.RELEASE/6e7971cc456c3072ddf0c35f1175502fb878d3dc/http-client-3.9.0.RELEASE.jar(com/rabbitmq/http/client/domain/ExchangeInfo.class): warning: Cannot find annotation method 'value()' in type 'JsonProperty'
/opt/users/bamboo/.gradle/caches/modules-2/files-2.1/com.rabbitmq/http-client/3.9.0.RELEASE/6e7971cc456c3072ddf0c35f1175502fb878d3dc/http-client-3.9.0.RELEASE.jar(com/rabbitmq/http/client/domain/ExchangeInfo.class): warning: Cannot find annotation method 'value()' in type 'JsonProperty'
/opt/users/bamboo/.gradle/caches/modules-2/files-2.1/com.rabbitmq/http-client/3.9.0.RELEASE/6e7971cc456c3072ddf0c35f1175502fb878d3dc/http-client-3.9.0.RELEASE.jar(com/rabbitmq/http/client/domain/BindingInfo.class): warning: Cannot find annotation method 'value()' in type 'JsonProperty'
/opt/users/bamboo/.gradle/caches/modules-2/files-2.1/com.rabbitmq/http-client/3.9.0.RELEASE/6e7971cc456c3072ddf0c35f1175502fb878d3dc/http-client-3.9.0.RELEASE.jar(com/rabbitmq/http/client/domain/BindingInfo.class): warning: Cannot find annotation method 'value()' in type 'JsonProperty'
/opt/users/bamboo/.gradle/caches/modules-2/files-2.1/com.rabbitmq/http-client/3.9.0.RELEASE/6e7971cc456c3072ddf0c35f1175502fb878d3dc/http-client-3.9.0.RELEASE.jar(com/rabbitmq/http/client/domain/BindingInfo.class): warning: Cannot find annotation method 'value()' in type 'JsonProperty'
36 warnings

FAILURE: Build failed with an exception.

* What went wrong:
Execution failed for task ':spring-rabbit-stream:compileTestJava'.
> Compilation failed; see the compiler error output for details.

* Try:
Run with --stacktrace option to get the stack trace. Run with --debug option to get more log output. Run with --scan to get full insights.

* Get more help at https://help.gradle.org

BUILD FAILED in 48s