Build #124

Build plan for MS Windows

Build: #124 failed Changes by Mahmoud Ben Hassine

Build result summary

Details

Completed
Duration
7 minutes
Labels
None
Revision
4e7c64a44344a53d49c5e9ecda2aa4f22c467fcf 4e7c64a44344a53d49c5e9ecda2aa4f22c467fcf
Total tests
3724
Fixed in
#129 (Changes by Mahmoud Ben Hassine)

Tests

Responsible

Code commits

Author Commit Message Commit date
Mahmoud Ben Hassine Mahmoud Ben Hassine 4e7c64a44344a53d49c5e9ecda2aa4f22c467fcf 4e7c64a44344a53d49c5e9ecda2aa4f22c467fcf Add method to set a custom BufferedReaderFactory in FlatFileItemReaderBuilder
Resolves BATCH-2770

Tests

New test failures 2
Status Test View job Duration
Collapse Failed SplitInterruptedJobParserTests testSplitInterrupted History
Default Job < 1 sec
java.lang.AssertionError: java.lang.AssertionError: Wrong step names: []
java.lang.AssertionError: Wrong step names: []
	at org.junit.Assert.fail(Assert.java:88)
	at org.junit.Assert.assertTrue(Assert.java:41)
	at org.springframework.batch.core.configuration.xml.SplitInterruptedJobParserTests.testSplitInterrupted(SplitInterruptedJobParserTests.java:61)
	at sun.reflect.NativeMethodAccessorImpl.invoke0(Native Method)
	at sun.reflect.NativeMethodAccessorImpl.invoke(NativeMethodAccessorImpl.java:62)
	at sun.reflect.DelegatingMethodAccessorImpl.invoke(DelegatingMethodAccessorImpl.java:43)
(51 more lines...)
Collapse Failed JsrSplitParsingTests test History
Default Job < 1 sec
java.lang.AssertionError: java.lang.AssertionError: expected:<COMPLETED> but was:<FAILED>
java.lang.AssertionError: expected:<COMPLETED> but was:<FAILED>
	at org.junit.Assert.fail(Assert.java:88)
	at org.junit.Assert.failNotEquals(Assert.java:834)
	at org.junit.Assert.assertEquals(Assert.java:118)
	at org.junit.Assert.assertEquals(Assert.java:144)
	at org.springframework.batch.core.jsr.configuration.xml.JsrSplitParsingTests.test(JsrSplitParsingTests.java:49)
	at sun.reflect.NativeMethodAccessorImpl.invoke0(Native Method)
(46 more lines...)

Jira issues

IssueDescriptionStatus
Unknown Issue TypeBATCH-2770Could not obtain issue details from Jira