Build #128

Build plan for MS Windows

Build: #128 failed Changes by Spring Buildmaster

Build result summary

Details

Completed
Duration
5 minutes
Labels
None
Revision
9135423424fe9a608446f70c4584219ae212d84f 9135423424fe9a608446f70c4584219ae212d84f
Total tests
3738
Failing since
#124 (Changes by Mahmoud Ben Hassine)
Fixed in
#129 (Changes by Mahmoud Ben Hassine)

Responsible

Code commits

Author Commit Message Commit date
Spring Buildmaster Spring Buildmaster 9135423424fe9a608446f70c4584219ae212d84f 9135423424fe9a608446f70c4584219ae212d84f [artifactory-release] Next development version
Spring Buildmaster Spring Buildmaster 84d408a85820c1cafba70db5599fde495c80d069 84d408a85820c1cafba70db5599fde495c80d069 [artifactory-release] Release version 4.2.0.M2

Tests

New test failures 2
Status Test View job Duration
Collapse Failed JsrSplitParsingTests test History
Default Job < 1 sec
java.lang.AssertionError: java.lang.AssertionError: expected:<COMPLETED> but was:<FAILED>
java.lang.AssertionError: expected:<COMPLETED> but was:<FAILED>
	at org.junit.Assert.fail(Assert.java:88)
	at org.junit.Assert.failNotEquals(Assert.java:834)
	at org.junit.Assert.assertEquals(Assert.java:118)
	at org.junit.Assert.assertEquals(Assert.java:144)
	at org.springframework.batch.core.jsr.configuration.xml.JsrSplitParsingTests.test(JsrSplitParsingTests.java:49)
	at sun.reflect.NativeMethodAccessorImpl.invoke0(Native Method)
(46 more lines...)
Collapse Failed KafkaItemReaderTests testReadFromMultiplePartitionsAfterRestart History
Default Job 3 secs
java.lang.AssertionError: java.lang.AssertionError: 
Expected: iterable over ["val4", "val6", "val7"] in any order
     but: Not matched: null
java.lang.AssertionError: 
Expected: iterable over ["val4", "val6", "val7"] in any order
     but: Not matched: null
	at org.hamcrest.MatcherAssert.assertThat(MatcherAssert.java:20)
	at org.junit.Assert.assertThat(Assert.java:956)
(51 more lines...)
Fixed tests 1
Status Test Failing since View job Duration
Successful SplitInterruptedJobParserTests testSplitInterrupted History
Failing since build #126 (Changes by Mahmoud Ben Hassine) Default Job < 1 sec