Build #176

Build plan for MS Windows

Build result summary

Details

Completed
Duration
63 minutes
Labels
None
Agent
bamboo-2k16-02
Revision
e5855c7e6bfb70ed7aea359c8a297dd87a4e9b23 e5855c7e6bfb70ed7aea359c8a297dd87a4e9b23
Total tests
1913
Failing since
#171 (Changes by Drummond Dawson <drumonii@users.noreply.github.com> and Mahmoud Ben Hassine)
Fixed in
#177 (Changes by Mahmoud Ben Hassine)

Tests

Responsible

Code commits

Author Commit Message Commit date
Drummond Dawson <drumonii@users.noreply.github.com> Drummond Dawson <drumonii@users.noreply.github.com> e5855c7e6bfb70ed7aea359c8a297dd87a4e9b23 e5855c7e6bfb70ed7aea359c8a297dd87a4e9b23 Support empty comments in FlatFileItemReaderBuilder
Previously, if supplying empty comments or no comments to comments() of the FlatFileItemReaderBuilder, the comments would be ignored and instead use the default comments "#" provided by the FlatFileItemReader.

Resolves BATCH-2837

Tests

Existing test failures 1
Status Test Failing since View job Duration
java.lang.AssertionError: java.lang.AssertionError
java.lang.AssertionError
	at org.junit.Assert.fail(Assert.java:86)
	at org.junit.Assert.assertTrue(Assert.java:41)
	at org.junit.Assert.assertTrue(Assert.java:52)
	at org.springframework.batch.core.jsr.partition.JsrPartitionHandlerTests.testPollingPartitionsCompletion(JsrPartitionHandlerTests.java:156)
	at sun.reflect.NativeMethodAccessorImpl.invoke0(Native Method)
	at sun.reflect.NativeMethodAccessorImpl.invoke(NativeMethodAccessorImpl.java:62)
(44 more lines...)

Jira issues

IssueDescriptionStatus
Unknown Issue TypeBATCH-2837Could not obtain issue details from Jira