Build #235

Build plan for MS Windows

Build result summary

Details

Completed
Duration
3 minutes
Labels
None
Agent
bamboo-2k16-02
Revision
5b25e98fd56d1652c32815c614f1dfd9e4cb23a0 5b25e98fd56d1652c32815c614f1dfd9e4cb23a0
Total tests
1919
Failing since
#233 (Changes by Parikshit Dutta <parikshitdutta@hotmail.com> and Mahmoud Ben Hassine <mbenhassine@vmware.com>)

Responsible

This build has been failing since #233
No one has taken responsibility

Code commits

Author Commit Message Commit date
Mahmoud Ben Hassine <mbenhassine@vmware.com> Mahmoud Ben Hassine <mbenhassine@vmware.com> 5b25e98fd56d1652c32815c614f1dfd9e4cb23a0 5b25e98fd56d1652c32815c614f1dfd9e4cb23a0 Update Spring projects dependencies to latest BUILD-SNAPSHOT
Spring Buildmaster Spring Buildmaster c510e868332bacc3468c6cdf182d522aea914649 c510e868332bacc3468c6cdf182d522aea914649 [artifactory-release] Next development version
Spring Buildmaster Spring Buildmaster a9cbb6cf20ee31cb22cf5f2df5fa053e16aa41dc a9cbb6cf20ee31cb22cf5f2df5fa053e16aa41dc [artifactory-release] Release version 4.3.0-M1

Tests

Existing test failures 1
Status Test Failing since View job Duration
java.lang.AssertionError: java.lang.AssertionError
java.lang.AssertionError
	at org.junit.Assert.fail(Assert.java:87)
	at org.junit.Assert.assertTrue(Assert.java:42)
	at org.junit.Assert.assertTrue(Assert.java:53)
	at org.springframework.batch.core.jsr.partition.JsrPartitionHandlerTests.testPollingPartitionsCompletion(JsrPartitionHandlerTests.java:156)
	at sun.reflect.NativeMethodAccessorImpl.invoke0(Native Method)
	at sun.reflect.NativeMethodAccessorImpl.invoke(NativeMethodAccessorImpl.java:62)
(47 more lines...)
Fixed tests 1
Status Test Failing since View job Duration
Successful DecisionStepTests testDecisionAfterSplit History
Failing since build #234 (Changes by Mahmoud Ben Hassine <mbenhassine@vmware.com>) Default Job < 1 sec