Build #244

Build plan for MS Windows

Build result summary

Details

Completed
Duration
3 minutes
Labels
None
Agent
bamboo-2k16-02
Revision
9dde5864421974d2580bdadce0f39da26db4b6e4 9dde5864421974d2580bdadce0f39da26db4b6e4
Total tests
1919
Failing since
#233 (Changes by Parikshit Dutta <parikshitdutta@hotmail.com> and Mahmoud Ben Hassine <mbenhassine@vmware.com>)
Fixed in
#248 (Changes by Mahmoud Ben Hassine <mbenhassine@vmware.com>)

Tests

Responsible

This build has been failing since #233
No one has taken responsibility

Code commits

Author Commit Message Commit date
Mahmoud Ben Hassine <mbenhassine@vmware.com> Mahmoud Ben Hassine <mbenhassine@vmware.com> 9dde5864421974d2580bdadce0f39da26db4b6e4 9dde5864421974d2580bdadce0f39da26db4b6e4 Open FlatFileItemReader#isComment for extension
Resolves #1134

Tests

Existing test failures 1
Status Test Failing since View job Duration
java.lang.AssertionError: java.lang.AssertionError
java.lang.AssertionError
	at org.junit.Assert.fail(Assert.java:87)
	at org.junit.Assert.assertTrue(Assert.java:42)
	at org.junit.Assert.assertTrue(Assert.java:53)
	at org.springframework.batch.core.jsr.partition.JsrPartitionHandlerTests.testPollingPartitionsCompletion(JsrPartitionHandlerTests.java:156)
	at sun.reflect.NativeMethodAccessorImpl.invoke0(Native Method)
	at sun.reflect.NativeMethodAccessorImpl.invoke(NativeMethodAccessorImpl.java:62)
(47 more lines...)