Build #267

Build plan for MS Windows

Build result summary

Details

Completed
Duration
3 minutes
Labels
None
Agent
bamboo-2k16-02
Revision
d87588c950b6cfb63998e571e05e3a2d4170e70c d87588c950b6cfb63998e571e05e3a2d4170e70c
Total tests
1925
Fixed in
#268 (Changes by Mahmoud Ben Hassine <mbenhassine@vmware.com>)

Tests

Responsible

No one has taken responsibility for this failure

Code commits

Author Commit Message Commit date
Mahmoud Ben Hassine <mbenhassine@vmware.com> Mahmoud Ben Hassine <mbenhassine@vmware.com> d87588c950b6cfb63998e571e05e3a2d4170e70c d87588c950b6cfb63998e571e05e3a2d4170e70c Replace spring-data-gemfire with spring-data-geode
See https://github.com/spring-projects/spring-data-geode/commit/f088aeb5ddc33f9d597bc11cd9ce5bc3cdcaf0e2

Tests

New test failures 1
Status Test View job Duration
Collapse Failed JsrPartitionHandlerTests testPollingPartitionsCompletion History
Default Job < 1 sec
java.lang.AssertionError: java.lang.AssertionError
java.lang.AssertionError
	at org.junit.Assert.fail(Assert.java:87)
	at org.junit.Assert.assertTrue(Assert.java:42)
	at org.junit.Assert.assertTrue(Assert.java:53)
	at org.springframework.batch.core.jsr.partition.JsrPartitionHandlerTests.testPollingPartitionsCompletion(JsrPartitionHandlerTests.java:156)
	at sun.reflect.NativeMethodAccessorImpl.invoke0(Native Method)
	at sun.reflect.NativeMethodAccessorImpl.invoke(NativeMethodAccessorImpl.java:62)
(47 more lines...)