Build #279

Build plan for MS Windows

Build: #279 failed Rebuilt by Mahmoud Ben Hassine

Build result summary

Details

Completed
Duration
3 minutes
Labels
None
Agent
bamboo-2k16-02
Revision
24aba13c2411cf943f63b60983eb9ef47b887e5e 24aba13c2411cf943f63b60983eb9ef47b887e5e
Total tests
1926
Failing since
#277 (Changes by Mahmoud Ben Hassine <mbenhassine@vmware.com>)
Fixed in
#280 (Changes by Mahmoud Ben Hassine <mbenhassine@vmware.com>)
Number of retries
2

Responsible

This build has been failing since #277
No one has taken responsibility

Code commits

Author Commit Message Commit date
Mahmoud Ben Hassine <mbenhassine@vmware.com> Mahmoud Ben Hassine <mbenhassine@vmware.com> 24aba13c2411cf943f63b60983eb9ef47b887e5e 24aba13c2411cf943f63b60983eb9ef47b887e5e Downgrade activemq version to 5.15.13
5.16 seems to introduce a regression
that makes jms related tests to fail.

Tests

New test failures 1
Status Test View job Duration
Collapse Failed JsrSplitParsingTests test History
Default Job < 1 sec
java.lang.AssertionError: java.lang.AssertionError: expected:<COMPLETED> but was:<FAILED>
java.lang.AssertionError: expected:<COMPLETED> but was:<FAILED>
	at org.junit.Assert.fail(Assert.java:89)
	at org.junit.Assert.failNotEquals(Assert.java:835)
	at org.junit.Assert.assertEquals(Assert.java:120)
	at org.junit.Assert.assertEquals(Assert.java:146)
	at org.springframework.batch.core.jsr.configuration.xml.JsrSplitParsingTests.test(JsrSplitParsingTests.java:49)
	at sun.reflect.NativeMethodAccessorImpl.invoke0(Native Method)
(48 more lines...)
Existing test failures 1
Status Test Failing since View job Duration
java.lang.AssertionError: java.lang.AssertionError
java.lang.AssertionError
	at org.junit.Assert.fail(Assert.java:87)
	at org.junit.Assert.assertTrue(Assert.java:42)
	at org.junit.Assert.assertTrue(Assert.java:53)
	at org.springframework.batch.core.jsr.partition.JsrPartitionHandlerTests.testPollingPartitionsCompletion(JsrPartitionHandlerTests.java:156)
	at sun.reflect.NativeMethodAccessorImpl.invoke0(Native Method)
	at sun.reflect.NativeMethodAccessorImpl.invoke(NativeMethodAccessorImpl.java:62)
(47 more lines...)