Build #281

Build plan for MS Windows

Build result summary

Details

Completed
Duration
7 minutes
Labels
None
Agent
bamboo-2k16-02
Revision
559be298a0441b156197d1cb6792f7cf8fbbec79 559be298a0441b156197d1cb6792f7cf8fbbec79
Total tests
1926

Tests

Responsible

No one has taken responsibility for this failure

Code commits

Author Commit Message Commit date
Mahmoud Ben Hassine <mbenhassine@vmware.com> Mahmoud Ben Hassine <mbenhassine@vmware.com> 559be298a0441b156197d1cb6792f7cf8fbbec79 559be298a0441b156197d1cb6792f7cf8fbbec79 Upgrade JUnit version to 4.13.1

Tests

New test failures 1
Status Test View job Duration
Collapse Failed JsrPartitionHandlerTests testPollingPartitionsCompletion History
Default Job 1 sec
java.lang.AssertionError: java.lang.AssertionError
java.lang.AssertionError
	at org.junit.Assert.fail(Assert.java:87)
	at org.junit.Assert.assertTrue(Assert.java:42)
	at org.junit.Assert.assertTrue(Assert.java:53)
	at org.springframework.batch.core.jsr.partition.JsrPartitionHandlerTests.testPollingPartitionsCompletion(JsrPartitionHandlerTests.java:156)
	at sun.reflect.NativeMethodAccessorImpl.invoke0(Native Method)
	at sun.reflect.NativeMethodAccessorImpl.invoke(NativeMethodAccessorImpl.java:62)
(47 more lines...)