Build #282

Build plan for MS Windows

Build result summary

Details

Completed
Duration
4 minutes
Labels
None
Agent
bamboo-2k16-02
Revision
791cfd5e8ab3b3260c23ff7cb24f7e03d678f8c1 791cfd5e8ab3b3260c23ff7cb24f7e03d678f8c1
Total tests
1927
Failing since
#281 (Changes by Mahmoud Ben Hassine <mbenhassine@vmware.com>)

Tests

Responsible

This build has been failing since #281
No one has taken responsibility

Code commits

Author Commit Message Commit date
Mahmoud Ben Hassine <mbenhassine@vmware.com> Mahmoud Ben Hassine <mbenhassine@vmware.com> 791cfd5e8ab3b3260c23ff7cb24f7e03d678f8c1 791cfd5e8ab3b3260c23ff7cb24f7e03d678f8c1 Polish 0c500794f6ef94d74196facd401d96210cd3a6f8
This commit adds a test case for building a flow
job with a job-scoped step.

Issue #857
Artyom Gabeev <artyom.gabeev@gmail.com> Artyom Gabeev <artyom.gabeev@gmail.com> 0c500794f6ef94d74196facd401d96210cd3a6f8 0c500794f6ef94d74196facd401d96210cd3a6f8 Do not call getName on step/flow - they may be Job/Step scoped proxies
Resolves #857
Mahmoud Ben Hassine <mbenhassine@vmware.com> Mahmoud Ben Hassine <mbenhassine@vmware.com> fae6c5b0967e0434ff73890cd192c8b7d9104365 fae6c5b0967e0434ff73890cd192c8b7d9104365 Update documentation about step scope usage
Issue #857

Tests

Existing test failures 1
Status Test Failing since View job Duration
java.lang.AssertionError: java.lang.AssertionError
java.lang.AssertionError
	at org.junit.Assert.fail(Assert.java:87)
	at org.junit.Assert.assertTrue(Assert.java:42)
	at org.junit.Assert.assertTrue(Assert.java:53)
	at org.springframework.batch.core.jsr.partition.JsrPartitionHandlerTests.testPollingPartitionsCompletion(JsrPartitionHandlerTests.java:156)
	at sun.reflect.NativeMethodAccessorImpl.invoke0(Native Method)
	at sun.reflect.NativeMethodAccessorImpl.invoke(NativeMethodAccessorImpl.java:62)
(47 more lines...)