Build #283

Build plan for MS Windows

Build result summary

Details

Completed
Duration
5 minutes
Labels
None
Agent
bamboo-2k16-02
Revision
70b508fcf41bd4af18107e6f4547fa2eec3f7b51 70b508fcf41bd4af18107e6f4547fa2eec3f7b51
Total tests
3574
Failing since
#281 (Changes by Mahmoud Ben Hassine <mbenhassine@vmware.com>)

Responsible

This build has been failing since #281
No one has taken responsibility

Code commits

Author Commit Message Commit date
Spring Buildmaster Spring Buildmaster 70b508fcf41bd4af18107e6f4547fa2eec3f7b51 70b508fcf41bd4af18107e6f4547fa2eec3f7b51 [artifactory-release] Next development version
Spring Buildmaster Spring Buildmaster 60c53a2bead506dd400616a4634402fafd7e4105 60c53a2bead506dd400616a4634402fafd7e4105 [artifactory-release] Release version 4.3.0
Mahmoud Ben Hassine <mbenhassine@vmware.com> Mahmoud Ben Hassine <mbenhassine@vmware.com> cd23fef19d7846f9bb10843b4f1a6d229d515a27 cd23fef19d7846f9bb10843b4f1a6d229d515a27 Update dependencies

Tests

New test failures 1
Status Test View job Duration
Collapse Failed LastModifiedResourceComparatorTests testCompareNewWithOldAfterCopy History
Default Job 1 sec
java.lang.AssertionError: java.lang.AssertionError: expected:<1> but was:<-1>
java.lang.AssertionError: expected:<1> but was:<-1>
	at org.junit.Assert.fail(Assert.java:89)
	at org.junit.Assert.failNotEquals(Assert.java:835)
	at org.junit.Assert.assertEquals(Assert.java:647)
	at org.junit.Assert.assertEquals(Assert.java:633)
	at org.springframework.batch.support.LastModifiedResourceComparatorTests.testCompareNewWithOldAfterCopy(LastModifiedResourceComparatorTests.java:77)
	at sun.reflect.NativeMethodAccessorImpl.invoke0(Native Method)
(47 more lines...)
Fixed tests 1
Status Test Failing since View job Duration
Successful JsrPartitionHandlerTests testPollingPartitionsCompletion History
Failing since build #281 (Changes by Mahmoud Ben Hassine <mbenhassine@vmware.com>) Default Job 1 sec