Build #284

Build plan for MS Windows

Build: #284 failed Rebuilt by Mahmoud Ben Hassine

Build result summary

Details

Completed
Duration
5 minutes
Labels
None
Agent
bamboo-2k16-02
Revision
2c3b2072121570f5b325d9332fa3ac1162938e4f 2c3b2072121570f5b325d9332fa3ac1162938e4f
Total tests
3574
Failing since
#281 (Changes by Mahmoud Ben Hassine <mbenhassine@vmware.com>)
Number of retries
2

Tests

Responsible

This build has been failing since #281
No one has taken responsibility

Code commits

Author Commit Message Commit date
Mahmoud Ben Hassine <mbenhassine@vmware.com> Mahmoud Ben Hassine <mbenhassine@vmware.com> 2c3b2072121570f5b325d9332fa3ac1162938e4f 2c3b2072121570f5b325d9332fa3ac1162938e4f Bump development version to 5.0.0-SNAPSHOT

Tests

Existing test failures 1
Status Test Failing since View job Duration
java.lang.AssertionError: java.lang.AssertionError: expected:<1> but was:<-1>
java.lang.AssertionError: expected:<1> but was:<-1>
	at org.junit.Assert.fail(Assert.java:89)
	at org.junit.Assert.failNotEquals(Assert.java:835)
	at org.junit.Assert.assertEquals(Assert.java:647)
	at org.junit.Assert.assertEquals(Assert.java:633)
	at org.springframework.batch.support.LastModifiedResourceComparatorTests.testCompareNewWithOldAfterCopy(LastModifiedResourceComparatorTests.java:77)
	at sun.reflect.NativeMethodAccessorImpl.invoke0(Native Method)
(47 more lines...)