Build #285

Build plan for MS Windows

Build result summary

Details

Completed
Duration
5 minutes
Labels
None
Agent
bamboo-2k16-02
Revision
f555ca901617ad4de9862c4a46624a560f38b45d f555ca901617ad4de9862c4a46624a560f38b45d
Total tests
1927
Failing since
#281 (Changes by Mahmoud Ben Hassine <mbenhassine@vmware.com>)

Tests

Responsible

This build has been failing since #281
No one has taken responsibility

Code commits

Author Commit Message Commit date
Mahmoud Ben Hassine <mbenhassine@vmware.com> Mahmoud Ben Hassine <mbenhassine@vmware.com> f555ca901617ad4de9862c4a46624a560f38b45d f555ca901617ad4de9862c4a46624a560f38b45d Update "what's new" section for version 5.0
Mahmoud Ben Hassine <mbenhassine@vmware.com> Mahmoud Ben Hassine <mbenhassine@vmware.com> e056c381fb8c4567b0e8c745b758b6111b458458 e056c381fb8c4567b0e8c745b758b6111b458458 Update gradle version to 6.7
Mahmoud Ben Hassine <mbenhassine@vmware.com> Mahmoud Ben Hassine <mbenhassine@vmware.com> 66e18e7248440de915d396e5c0a6ab5915e9ee33 66e18e7248440de915d396e5c0a6ab5915e9ee33 Update sonarqube plugin version to 3.0

Tests

New test failures 1
Status Test View job Duration
Collapse Failed JsrPartitionHandlerTests testPollingPartitionsCompletion History
Default Job < 1 sec
java.lang.AssertionError: java.lang.AssertionError
java.lang.AssertionError
	at org.junit.Assert.fail(Assert.java:87)
	at org.junit.Assert.assertTrue(Assert.java:42)
	at org.junit.Assert.assertTrue(Assert.java:53)
	at org.springframework.batch.core.jsr.partition.JsrPartitionHandlerTests.testPollingPartitionsCompletion(JsrPartitionHandlerTests.java:156)
	at sun.reflect.NativeMethodAccessorImpl.invoke0(Native Method)
	at sun.reflect.NativeMethodAccessorImpl.invoke(NativeMethodAccessorImpl.java:62)
(47 more lines...)