Build #289

Build plan for MS Windows

Build: #289 failed Rebuilt by Mahmoud Ben Hassine

Build result summary

Details

Completed
Duration
5 minutes
Labels
None
Agent
bamboo-2k16-02
Revision
e58ca37e1b4160db68f0186db37184638a04c8c3 e58ca37e1b4160db68f0186db37184638a04c8c3
Total tests
3577
Failing since
#281 (Changes by Mahmoud Ben Hassine <mbenhassine@vmware.com>)
Number of retries
2

Tests

Responsible

This build has been failing since #281
No one has taken responsibility

Code commits

Author Commit Message Commit date
Mahmoud Ben Hassine <mbenhassine@vmware.com> Mahmoud Ben Hassine <mbenhassine@vmware.com> e58ca37e1b4160db68f0186db37184638a04c8c3 e58ca37e1b4160db68f0186db37184638a04c8c3 Update build to resolve dependencies from maven central first
Mahmoud Ben Hassine <mbenhassine@vmware.com> Mahmoud Ben Hassine <mbenhassine@vmware.com> da8c6c863fa7d4ec645350b7803a7660c476398e da8c6c863fa7d4ec645350b7803a7660c476398e Polish contribution cbdb251441968197aca805cdda4e634ab8542c39
* Fix assertion messages in tests
* Use transactional tests instead of a separate
  service with a transactional method
Antoine Kapps <antoine.kapps@orange.fr> Antoine Kapps <antoine.kapps@orange.fr> cbdb251441968197aca805cdda4e634ab8542c39 cbdb251441968197aca805cdda4e634ab8542c39 Fix incorrect behaviour of RepositoryItemReader#jumpToItem() on restart
* Corrects unit tests with expected behavior.
* Creates integration tests highlighting Hibernate lazy-loading failure if the reader has requested the page on open().

Issue #1074

Tests

New test failures 1
Status Test View job Duration
Collapse Failed LastModifiedResourceComparatorTests testCompareNewWithOldAfterCopy History
Default Job < 1 sec
java.lang.AssertionError: java.lang.AssertionError: expected:<1> but was:<-1>
java.lang.AssertionError: expected:<1> but was:<-1>
	at org.junit.Assert.fail(Assert.java:89)
	at org.junit.Assert.failNotEquals(Assert.java:835)
	at org.junit.Assert.assertEquals(Assert.java:647)
	at org.junit.Assert.assertEquals(Assert.java:633)
	at org.springframework.batch.support.LastModifiedResourceComparatorTests.testCompareNewWithOldAfterCopy(LastModifiedResourceComparatorTests.java:77)
	at sun.reflect.NativeMethodAccessorImpl.invoke0(Native Method)
(47 more lines...)