Build #289

Build plan for MS Windows

Build: #289 failed Rebuilt by Mahmoud Ben Hassine

Test results

  • 3,577 tests in total
  • 1 test failed
  • 1 failure is new
  • 8 tests were quarantined / skipped
  • 1 minute taken in total.
New test failures 1
Status Test View job Duration
Collapse Failed LastModifiedResourceComparatorTests testCompareNewWithOldAfterCopy History
Default Job < 1 sec
java.lang.AssertionError: java.lang.AssertionError: expected:<1> but was:<-1>
java.lang.AssertionError: expected:<1> but was:<-1>
	at org.junit.Assert.fail(Assert.java:89)
	at org.junit.Assert.failNotEquals(Assert.java:835)
	at org.junit.Assert.assertEquals(Assert.java:647)
	at org.junit.Assert.assertEquals(Assert.java:633)
	at org.springframework.batch.support.LastModifiedResourceComparatorTests.testCompareNewWithOldAfterCopy(LastModifiedResourceComparatorTests.java:77)
	at sun.reflect.NativeMethodAccessorImpl.invoke0(Native Method)
(47 more lines...)
Skipped tests 8
Status Test Failing since View job
Skipped ItemListenerErrorTests testOnReadError History
Default Job
Skipped JobRepositoryFactoryBeanTests testTransactionAttributesForCreateMethodNullHypothesis History
Default Job
Skipped StepScopeClassIntegrationTests testNested History
Default Job
Skipped StepScopeClassIntegrationTests testSimpleValue History
Default Job
Skipped FaultTolerantStepFactoryBeanUnexpectedRollbackTests testTransactionException History
Default Job
Skipped AsyncChunkOrientedStepIntegrationTests testStatus History
Default Job
Skipped ChunkOrientedStepIntegrationTests testStatusForCommitFailedException History
Default Job
Skipped ConcurrentTransactionAwareProxyTests testConcurrentTransactionalList History
Default Job