Build #290

Build plan for MS Windows

Build: #290 failed Rebuilt by Mahmoud Ben Hassine

Build result summary

Details

Completed
Duration
3 minutes
Labels
None
Agent
bamboo-2k16-02
Revision
e58ca37e1b4160db68f0186db37184638a04c8c3 e58ca37e1b4160db68f0186db37184638a04c8c3
Total tests
1929
Failing since
#281 (Changes by Mahmoud Ben Hassine <mbenhassine@vmware.com>)
Number of retries
1

Tests

Responsible

This build has been failing since #281
No one has taken responsibility

Tests

New test failures 1
Status Test View job Duration
Collapse Failed JsrPartitionHandlerTests testPollingPartitionsCompletion History
Default Job < 1 sec
java.lang.AssertionError: java.lang.AssertionError
java.lang.AssertionError
	at org.junit.Assert.fail(Assert.java:87)
	at org.junit.Assert.assertTrue(Assert.java:42)
	at org.junit.Assert.assertTrue(Assert.java:53)
	at org.springframework.batch.core.jsr.partition.JsrPartitionHandlerTests.testPollingPartitionsCompletion(JsrPartitionHandlerTests.java:156)
	at sun.reflect.NativeMethodAccessorImpl.invoke0(Native Method)
	at sun.reflect.NativeMethodAccessorImpl.invoke(NativeMethodAccessorImpl.java:62)
(47 more lines...)