Build #291

Build plan for MS Windows

Build: #291 failed Changes by 3 people

Build result summary

Details

Completed
Duration
5 minutes
Labels
None
Agent
bamboo-2k16-02
Revision
c8e5e507f420d54c0fa9bd493973db731cd37d2a c8e5e507f420d54c0fa9bd493973db731cd37d2a
Total tests
3579
Failing since
#281 (Changes by Mahmoud Ben Hassine <mbenhassine@vmware.com>)

Responsible

This build has been failing since #281
No one has taken responsibility

Code commits

Author Commit Message Commit date
Mahmoud Ben Hassine <mbenhassine@vmware.com> Mahmoud Ben Hassine <mbenhassine@vmware.com> c8e5e507f420d54c0fa9bd493973db731cd37d2a c8e5e507f420d54c0fa9bd493973db731cd37d2a Polish contribution feb46fd3f74716db42e2d34639d4a6952e7267e5
* Update year in license header
* Use "this" keyword where appropriate
Aditya Sathe <satheaditya2014@gmail.com> Aditya Sathe <satheaditya2014@gmail.com> feb46fd3f74716db42e2d34639d4a6952e7267e5 feb46fd3f74716db42e2d34639d4a6952e7267e5 Make kafkaTemplate protected in KafkaItemWriter
Issue #3802
Mahmoud Ben Hassine <mbenhassine@vmware.com> Mahmoud Ben Hassine <mbenhassine@vmware.com> 62ce169f3765c32ff78c674412757d932818b1b4 62ce169f3765c32ff78c674412757d932818b1b4 Add maven central to buildscript repository
Henning Poettker <henning.poettker@c24.de> Henning Poettker <henning.poettker@c24.de> b6c3fb6d8ce6167e80ab10109a698b7767c97cd4 b6c3fb6d8ce6167e80ab10109a698b7767c97cd4 Fix NullPointerException when creating job executions for job instances without executions

Tests

New test failures 1
Status Test View job Duration
Collapse Failed LastModifiedResourceComparatorTests testCompareNewWithOldAfterCopy History
Default Job < 1 sec
java.lang.AssertionError: java.lang.AssertionError: expected:<1> but was:<-1>
java.lang.AssertionError: expected:<1> but was:<-1>
	at org.junit.Assert.fail(Assert.java:89)
	at org.junit.Assert.failNotEquals(Assert.java:835)
	at org.junit.Assert.assertEquals(Assert.java:647)
	at org.junit.Assert.assertEquals(Assert.java:633)
	at org.springframework.batch.support.LastModifiedResourceComparatorTests.testCompareNewWithOldAfterCopy(LastModifiedResourceComparatorTests.java:77)
	at sun.reflect.NativeMethodAccessorImpl.invoke0(Native Method)
(47 more lines...)
Fixed tests 1
Status Test Failing since View job Duration
Successful JsrPartitionHandlerTests testPollingPartitionsCompletion History
Failing since build #290 (Rebuilt by Mahmoud Ben Hassine) Default Job 1 sec