Build #53

Build plan for MS Windows

Build: #53 failed Changes by Mahmoud Ben Hassine

Build result summary

Details

Completed
Duration
12 minutes
Labels
None
Agent
bamboo-2k16-00
Revision
249fa2673e4864ea89012110472b9de06a5ab91c 249fa2673e4864ea89012110472b9de06a5ab91c
Total tests
1899
Failing since
#1 (First build for this plan – )
Fixed in
#87 (Changes by Mahmoud Ben Hassine)

Responsible

This build has been failing since #1
No one has taken responsibility

Code commits

Author Commit Message Commit date
Mahmoud Ben Hassine Mahmoud Ben Hassine 249fa2673e4864ea89012110472b9de06a5ab91c 249fa2673e4864ea89012110472b9de06a5ab91c Fix typos

Tests

New test failures 1
Status Test View job Duration
Collapse Failed SystemCommandTaskletIntegrationTests testStopped History
Default Job < 1 sec
org.junit.ComparisonFailure: org.junit.ComparisonFailure: expected:<[COMPLET]ED> but was:<[STOPP]ED>
org.junit.ComparisonFailure: expected:<[COMPLET]ED> but was:<[STOPP]ED>
	at org.junit.Assert.assertEquals(Assert.java:115)
	at org.junit.Assert.assertEquals(Assert.java:144)
	at org.springframework.batch.core.step.tasklet.SystemCommandTaskletIntegrationTests.testStopped(SystemCommandTaskletIntegrationTests.java:284)
	at sun.reflect.NativeMethodAccessorImpl.invoke0(Native Method)
	at sun.reflect.NativeMethodAccessorImpl.invoke(NativeMethodAccessorImpl.java:62)
	at sun.reflect.DelegatingMethodAccessorImpl.invoke(DelegatingMethodAccessorImpl.java:43)
(43 more lines...)
Existing test failures 2
Status Test Failing since View job Duration
java.lang.AssertionError: java.lang.AssertionError: expected:<FAILED> but was:<COMPLETED>
java.lang.AssertionError: expected:<FAILED> but was:<COMPLETED>
	at org.junit.Assert.fail(Assert.java:88)
	at org.junit.Assert.failNotEquals(Assert.java:834)
	at org.junit.Assert.assertEquals(Assert.java:118)
	at org.junit.Assert.assertEquals(Assert.java:144)
	at org.springframework.batch.core.step.item.FaultTolerantExceptionClassesTests.testNoRollbackTaskletRollbackException(FaultTolerantExceptionClassesTests.java:323)
	at sun.reflect.NativeMethodAccessorImpl.invoke0(Native Method)
(53 more lines...)
java.lang.NullPointerException: java.lang.NullPointerException
java.lang.NullPointerException
	at org.springframework.batch.core.step.tasklet.SystemCommandTasklet.execute(SystemCommandTasklet.java:124)
	at org.springframework.batch.core.step.tasklet.SystemCommandTaskletIntegrationTests.testExecuteTimeout(SystemCommandTaskletIntegrationTests.java:148)
	at sun.reflect.NativeMethodAccessorImpl.invoke0(Native Method)
	at sun.reflect.NativeMethodAccessorImpl.invoke(NativeMethodAccessorImpl.java:62)
	at sun.reflect.DelegatingMethodAccessorImpl.invoke(DelegatingMethodAccessorImpl.java:43)
	at java.lang.reflect.Method.invoke(Method.java:498)
(42 more lines...)
Fixed tests 1
Status Test Failing since View job Duration
Successful JsrPartitionHandlerTests testPollingPartitionsCompletion History
Failing since build #41 (Changes by Mahmoud Ben Hassine) Default Job 1 sec