Build #79

Build plan for MS Windows

Build: #79 failed Changes by Mahmoud Ben Hassine

Build result summary

Details

Completed
Duration
10 minutes
Labels
None
Agent
bamboo-2k16-00
Revision
7ca11f2f998e5e46b35ec7a56fcd0e62b572b667 7ca11f2f998e5e46b35ec7a56fcd0e62b572b667
Total tests
1903
Failing since
#1 (First build for this plan – )
Fixed in
#87 (Changes by Mahmoud Ben Hassine)

Responsible

Code commits

Author Commit Message Commit date
Mahmoud Ben Hassine Mahmoud Ben Hassine 7ca11f2f998e5e46b35ec7a56fcd0e62b572b667 7ca11f2f998e5e46b35ec7a56fcd0e62b572b667 Add assertion that a serializer was set in the JdbcExecutionContextDao
Resolves BATCH-2779

Tests

New test failures 3
Status Test View job Duration
Collapse Failed JsrSplitParsingTests test History
Default Job < 1 sec
java.lang.AssertionError: java.lang.AssertionError: expected:<COMPLETED> but was:<FAILED>
java.lang.AssertionError: expected:<COMPLETED> but was:<FAILED>
	at org.junit.Assert.fail(Assert.java:88)
	at org.junit.Assert.failNotEquals(Assert.java:834)
	at org.junit.Assert.assertEquals(Assert.java:118)
	at org.junit.Assert.assertEquals(Assert.java:144)
	at org.springframework.batch.core.jsr.configuration.xml.JsrSplitParsingTests.test(JsrSplitParsingTests.java:49)
	at sun.reflect.NativeMethodAccessorImpl.invoke0(Native Method)
(46 more lines...)
Collapse Failed JsrPartitionHandlerTests testHardcodedNumberOfPartitions History
Default Job < 1 sec
java.lang.AssertionError: java.lang.AssertionError: expected:<3> but was:<2>
java.lang.AssertionError: expected:<3> but was:<2>
	at org.junit.Assert.fail(Assert.java:88)
	at org.junit.Assert.failNotEquals(Assert.java:834)
	at org.junit.Assert.assertEquals(Assert.java:645)
	at org.junit.Assert.assertEquals(Assert.java:631)
	at org.springframework.batch.core.jsr.partition.JsrPartitionHandlerTests.testHardcodedNumberOfPartitions(JsrPartitionHandlerTests.java:138)
	at sun.reflect.NativeMethodAccessorImpl.invoke0(Native Method)
(45 more lines...)
Collapse Failed FaultTolerantExceptionClassesTests testNoRollbackTaskletRollbackException History
Default Job < 1 sec
java.lang.AssertionError: java.lang.AssertionError: expected:<FAILED> but was:<COMPLETED>
java.lang.AssertionError: expected:<FAILED> but was:<COMPLETED>
	at org.junit.Assert.fail(Assert.java:88)
	at org.junit.Assert.failNotEquals(Assert.java:834)
	at org.junit.Assert.assertEquals(Assert.java:118)
	at org.junit.Assert.assertEquals(Assert.java:144)
	at org.springframework.batch.core.step.item.FaultTolerantExceptionClassesTests.testNoRollbackTaskletRollbackException(FaultTolerantExceptionClassesTests.java:323)
	at sun.reflect.NativeMethodAccessorImpl.invoke0(Native Method)
(53 more lines...)
Existing test failures 2
Status Test Failing since View job Duration
org.junit.ComparisonFailure: org.junit.ComparisonFailure: expected:<[COMPLET]ED> but was:<[STOPP]ED>
org.junit.ComparisonFailure: expected:<[COMPLET]ED> but was:<[STOPP]ED>
	at org.junit.Assert.assertEquals(Assert.java:115)
	at org.junit.Assert.assertEquals(Assert.java:144)
	at org.springframework.batch.core.step.tasklet.SystemCommandTaskletIntegrationTests.testStopped(SystemCommandTaskletIntegrationTests.java:284)
	at sun.reflect.NativeMethodAccessorImpl.invoke0(Native Method)
	at sun.reflect.NativeMethodAccessorImpl.invoke(NativeMethodAccessorImpl.java:62)
	at sun.reflect.DelegatingMethodAccessorImpl.invoke(DelegatingMethodAccessorImpl.java:43)
(43 more lines...)
java.lang.NullPointerException: java.lang.NullPointerException
java.lang.NullPointerException
	at org.springframework.batch.core.step.tasklet.SystemCommandTasklet.execute(SystemCommandTasklet.java:124)
	at org.springframework.batch.core.step.tasklet.SystemCommandTaskletIntegrationTests.testExecuteTimeout(SystemCommandTaskletIntegrationTests.java:148)
	at sun.reflect.NativeMethodAccessorImpl.invoke0(Native Method)
	at sun.reflect.NativeMethodAccessorImpl.invoke(NativeMethodAccessorImpl.java:62)
	at sun.reflect.DelegatingMethodAccessorImpl.invoke(DelegatingMethodAccessorImpl.java:43)
	at java.lang.reflect.Method.invoke(Method.java:498)
(42 more lines...)
Fixed tests 1
Status Test Failing since View job Duration
Successful JsrPartitionHandlerTests testMapperProvidesPartitions History
Failing since build #78 (Changes by Mahmoud Ben Hassine) Default Job < 1 sec

JIRA issues

IssueDescriptionStatus
Unknown Issue TypeBATCH-2779Could not obtain issue details from JIRA