Build #80

Build plan for MS Windows

Build: #80 failed Changes by Mahmoud Ben Hassine

Logs

The following logs have been generated by the jobs in this plan.
  • Expand all
  • Collapse all
Job Logs
Collapse Default Job Default Stage Download or View
14-Jan-2019 14:08:10
14-Jan-2019 14:08:10 org.springframework.batch.core.step.tasklet.SystemCommandTaskletIntegrationTests > testStopped FAILED
14-Jan-2019 14:08:10     org.junit.ComparisonFailure at SystemCommandTaskletIntegrationTests.java:284
14-Jan-2019 14:08:11
14-Jan-2019 14:08:11 1903 tests completed, 2 failed, 7 skipped
14-Jan-2019 14:08:12
14-Jan-2019 14:08:12 > Task :spring-batch-core:test FAILED
14-Jan-2019 14:08:12
14-Jan-2019 14:08:12 FAILURE: Build failed with an exception.
14-Jan-2019 14:08:12
14-Jan-2019 14:08:12 * What went wrong:
14-Jan-2019 14:08:12 Execution failed for task ':spring-batch-core:test'.
14-Jan-2019 14:08:12 > There were failing tests. See the report at: file:///C:/opt/bamboo-home/xml-data/build-dir/BATCH-BATCHWIN-JOB1/spring-batch-core/build/reports/tests/test/index.html
14-Jan-2019 14:08:12
14-Jan-2019 14:08:12 * Try:
14-Jan-2019 14:08:12 Run with --stacktrace option to get the stack trace. Run with --info or --debug option to get more log output. Run with --scan to get full insights.
14-Jan-2019 14:08:12
14-Jan-2019 14:08:12 * Get more help at https://help.gradle.org
14-Jan-2019 14:08:12
14-Jan-2019 14:08:12 Deprecated Gradle features were used in this build, making it incompatible with Gradle 5.0.
14-Jan-2019 14:08:12 Use '--warning-mode all' to show the individual deprecation warnings.
14-Jan-2019 14:08:12 See https://docs.gradle.org/4.10/userguide/command_line_interface.html#sec:command_line_warnings
14-Jan-2019 14:08:12 38 actionable tasks: 29 executed, 9 up-to-date
14-Jan-2019 14:08:12
14-Jan-2019 14:08:12 BUILD FAILED in 4m 29s