Build #124

Build plan for MS Windows

Build: #124 failed

Job: Default Job failed

Stages & jobs

  1. Default Stage

Build log

The build generated 338 lines of output. Download or view full build log

09-May-2019 14:50:08 Build Spring Batch - Windows - Default Job #124 (BATCH-BATCHWIN-JOB1-124) started building on agent bamboo-2k16-00
09-May-2019 14:50:08 Remote agent on host bamboo-2k6-00
09-May-2019 14:50:08 Build working directory is C:\opt\bamboo-home\xml-data\build-dir\BATCH-BATCHWIN-JOB1
09-May-2019 14:50:08 Executing build Spring Batch - Windows - Default Job #124 (BATCH-BATCHWIN-JOB1-124)
09-May-2019 14:50:08 Starting task 'Checkout Default Repository' of type 'com.atlassian.bamboo.plugins.vcs:task.vcs.checkout'
09-May-2019 14:50:08 Build always requires a clean checkout
09-May-2019 14:50:08 Cleaning build directory 'C:\opt\bamboo-home\xml-data\build-dir\BATCH-BATCHWIN-JOB1'
09-May-2019 14:50:08 Checking out into C:\opt\bamboo-home\xml-data\build-dir\BATCH-BATCHWIN-JOB1
09-May-2019 14:50:08 Updating source code to revision: 4e7c64a44344a53d49c5e9ecda2aa4f22c467fcf
09-May-2019 14:50:08 Creating local git repository in 'C:\opt\bamboo-home\xml-data\build-dir\BATCH-BATCHWIN-JOB1\.git'.
09-May-2019 14:50:08 Initialized empty Git repository in C:/opt/bamboo-home/xml-data/build-dir/BATCH-BATCHWIN-JOB1/.git/
09-May-2019 14:50:09 Fetching 'refs/heads/master' from 'https://github.com/benas/spring-batch.git'.
09-May-2019 14:52:27 From https://github.com/benas/spring-batch
09-May-2019 14:52:27 * [new branch]          master     -> master
09-May-2019 14:52:27 * [new tag]             2.2.0.M1      -> 2.2.0.M1
09-May-2019 14:52:27 * [new tag]             2.2.0.RC1     -> 2.2.0.RC1
09-May-2019 14:52:27 * [new tag]             2.2.0.RC2     -> 2.2.0.RC2
09-May-2019 14:52:27 * [new tag]             2.2.0.RELEASE -> 2.2.0.RELEASE
09-May-2019 14:52:27 * [new tag]             2.2.1.RELEASE -> 2.2.1.RELEASE
09-May-2019 14:52:27 * [new tag]             3.0.0.M1      -> 3.0.0.M1
09-May-2019 14:52:27 * [new tag]             3.0.0.M2      -> 3.0.0.M2
09-May-2019 14:52:27 * [new tag]             3.0.0.M3      -> 3.0.0.M3
09-May-2019 14:52:27 Checking out revision 4e7c64a44344a53d49c5e9ecda2aa4f22c467fcf.
09-May-2019 14:52:28 Already on 'master'
09-May-2019 14:52:28 Updated source code to revision: 4e7c64a44344a53d49c5e9ecda2aa4f22c467fcf
09-May-2019 14:52:28 Finished task 'Checkout Default Repository' with result: Success
09-May-2019 14:52:28 Running pre-build action: Artifactory Release Staging
09-May-2019 14:52:28 Running pre-build action: VCS Version Collector
09-May-2019 14:52:28 Starting task 'Gradle build' of type 'org.jfrog.bamboo.bamboo-artifactory-plugin:artifactoryGradleTask'
09-May-2019 14:52:28 Bamboo Artifactory Plugin version: 2.5.x-SNAPSHOT
09-May-2019 14:52:28
Beginning to execute external process for build 'Spring Batch - Windows - Default Job #124 (BATCH-BATCHWIN-JOB1-124)'
... running command line:
./gradlew.bat -x javadoc -x asciidoc -x makePDF --parallel clean build jacocoTestReport runTck -I C:\Users\bamboo\AppData\Local\Temp\artifactory.init.script3195146972355040066gradle -DbuildInfoConfig.propertiesFile=C:\Users\bamboo\AppData\Local\Temp\buildinfo626999526521246011properties artifactoryPublish -Dartifactory.resolve.password=******** -Dartifactory.publish.password=********
... in: C:\opt\bamboo-home\xml-data\build-dir\BATCH-BATCHWIN-JOB1
... using extra environment variables:
bamboo_planRepository_1_branch=master
bamboo_********_username_password=********
bamboo_signing_store_password=********
bamboo_capability_system_builder_ant_Ant_1_9=C:\opt\apache-ant-1.9.9
bamboo_capability_system_builder_ant_Ant_1_8=C:\opt\apache-ant-1.8.4
bamboo_planRepository_1_branchDisplayName=master
bamboo_repository_revision_number=4e7c64a44344a53d49c5e9ecda2aa4f22c467fcf
ALLUSERSPROFILE=C:\ProgramData
bamboo_capability_system_builder_node_Node_js_6=/usr/bin/node
bamboo_RIAK_BIN=/usr/sbin/riak
bamboo_repository_268501009_git_repositoryUrl=https://github.com/benas/spring-batch.git
WRAPPER_BITS=64
bamboo_capability_system_builder_node_Node_js_8=C:\Program Files
odejs
ode.exe
bamboo_buildKey=BATCH-BATCHWIN-JOB1
SystemDrive=C:
bamboo_bintray_password=********
USERNAME=SYSTEM
bamboo_repository_268501009_revision_number=4e7c64a44344a53d49c5e9ecda2aa4f22c467fcf
bamboo_sonar_token_password=********
ProgramFiles(x86)=C:\Program Files (x86)
bamboo_shortJobName=Default Job
bamboo_capability_system_builder_gradle___gradlew=./gradlew
bamboo_buildResultsUrl=https://build.spring.io/browse/BATCH-BATCHWIN-JOB1-124
bamboo_capability_system_builder_mvn3_Maven_3_3=C:\opt\apache-maven-3.3.9
bamboo_capability_system_builder_mvn3_Maven_3_2=C:\opt\apache-maven-3.2.5
bamboo_capability_system_builder_mvn3_Maven_3_1=C:\opt/apache-maven-3.1.1
bamboo_planRepository_repositoryUrl=https://github.com/benas/spring-batch.git
PATHEXT=.COM;.EXE;.BAT;.CMD;.VBS;.VBE;.JS;.JSE;.WSF;.WSH;.MSC
bamboo_agentId=245596161
bamboo_capability_system_builder_mvn3_Maven_3_5=C:\opt\apache-maven-3.5.0
bamboo_capability_system_builder_mvn3_Maven_3_0=C:\opt\apache-maven-3.0.5
bamboo_planRepository_revision=4e7c64a44344a53d49c5e9ecda2aa4f22c467fcf
bamboo_planRepository_previousRevision=e6a84e1ac244058f775ea0587e6612a4e899b0e6
PROCESSOR_IDENTIFIER=Intel64 Family 6 Model 85 Stepping 4, GenuineIntel
bamboo_capability_remote_build=true
bamboo_repository_branch_name=master
ProgramFiles=C:\Program Files
PUBLIC=C:\Users\Public
windir=C:\Windows
bamboo_sonatype_token_password=********
bamboo_scdf_acceptance_tests_password=********
WRAPPER_OS=windows
JAVA_HOME=C:\opt\jdk1.8.0_161\
bamboo_repository_268501009_previous_revision_number=e6a84e1ac244058f775ea0587e6612a4e899b0e6
bamboo_planRepository_branch=master
=C:=C:\opt\bamboo-home\bin
APPDATA=C:\Users\bamboo\AppData\Roaming
bamboo_planRepository_1_type=gitv2
bamboo_planRepository_branchName=master
WRAPPER_FILE_SEPARATOR=\
bamboo_capability_system_builder_ant_Ant_1_10=C:\opt\apache-ant-1.10.1
COMPUTERNAME=WIN-TV86RA8UDK1
WRAPPER_PATH_SEPARATOR=;
bamboo_sonar_password=********
bamboo_hg_cache_directory=C:\opt\bamboo-home\xml-data\build-dir\_hg-repositories-cache
bamboo_planRepository_1_username=spring-buildmaster
bamboo_planRepository_type=gitv2
bamboo_repository_268501009_name=Git
bamboo_git_cache_directory=C:\opt\bamboo-home\xml-data\build-dir\_git-repositories-cache
ComSpec=C:\Windows\system32\cmd.exe
bamboo_artifactory_username=buildmaster
bamboo_tmp_directory=C:\opt\bamboo-home\temp
bamboo_planKey=BATCH-BATCHWIN
bamboo_planRepository_username=spring-buildmaster
bamboo_JDK8_HOME=/opt/jdk-8
NUMBER_OF_PROCESSORS=4
bamboo_planRepository_1_branchName=master
bamboo_sonar_version=5.6.3
PROCESSOR_LEVEL=6
bamboo_resultsUrl=https://build.spring.io/browse/BATCH-BATCHWIN-JOB1-124
PROCESSOR_ARCHITECTURE=AMD64
bamboo_build_working_directory=C:\opt\bamboo-home\xml-data\build-dir\BATCH-BATCHWIN-JOB1
bamboo_planRepository_1_name=Git
PSModulePath=C:\Program Files\WindowsPowerShell\Modules;C:\Windows\system32\WindowsPowerShell\v1.0\Modules
bamboo_capability_system_os=windows2016
bamboo_nexusPush_stagingProfile=buildmaster
bamboo_shortPlanName=Windows
bamboo_planRepository_name=Git
bamboo_repository_268501009_branch_name=master
bamboo_buildNumber=124
bamboo_planName=Spring Batch - Windows
bamboo_JDK7_HOME=/opt/jdk-7
bamboo_shortPlanKey=BATCHWIN
bamboo_shortJobKey=JOB1
bamboo_artifactory_password=********
bamboo_repository_268501009_git_branch=master
ProgramData=C:\ProgramData
ProgramW6432=C:\Program Files
bamboo_buildTimeStamp=2019-05-09T14:50:08.304Z
bamboo_repository_previous_revision_number=e6a84e1ac244058f775ea0587e6612a4e899b0e6
bamboo_sonar_username=buildmaster
bamboo_********_password=********
bamboo_repository_git_branch=master
bamboo_buildResultKey=BATCH-BATCHWIN-JOB1-124
bamboo_nexusPush_close=true
bamboo_buildPlanName=Spring Batch - Windows - Default Job
bamboo_planRepository_1_revision=4e7c64a44344a53d49c5e9ecda2aa4f22c467fcf
LOCALAPPDATA=C:\Users\bamboo\AppData\Local
bamboo_repository_name=Git
bamboo_signing_key_password=********
USERDOMAIN=WIN-TV86RA8UDK1
bamboo_JSR_352_TCK_HOME="C:\opt\jsr352-tck-1.0"
JSR_352_TCK_HOME=C:\opt\jsr352-tck-1.0
bamboo_buildFailed=false
bamboo_capability_system_docker_executable=/usr/bin/docker
bamboo_artifactory_password_mask_b=********
bamboo_artifactory_password_mask_a=********
bamboo_agentWorkingDirectory=C:\opt\bamboo-home\xml-data\build-dir
bamboo_capability_system_git_executable=C:\Program Files\Git\bin\git.exe
bamboo_repository_git_username=spring-buildmaster
bamboo_planRepository_1_previousRevision=e6a84e1ac244058f775ea0587e6612a4e899b0e6
bamboo_capability_os_family=windows
bamboo_planRepository_branchDisplayName=master
CommonProgramFiles=C:\Program Files\Common Files
bamboo_capability_system_builder_maven_Artifactory_Maven_3_5=C:\opt\apache-maven-3.5.0
bamboo_capability_system_builder_maven_Artifactory_Maven_3_3=C:\opt\apache-maven-3.3.9
bamboo_capability_system_builder_maven_Artifactory_Maven_3_2=C:\opt\apache-maven-3.2.5
bamboo_s3_properties=/home/bamboo/tools/s3.properties
OS=Windows_NT
bamboo_capability_system_builder_maven_Artifactory_Maven_3_1=C:\opt\apache-maven-3.1.1
bamboo_capability_system_builder_maven_Artifactory_Maven_3_0=C:\opt\apache-maven-3.0.5
bamboo_plan_storageTag=plan-268238890
bamboo_bintray_username_password=********
PROCESSOR_REVISION=5504
bamboo_repository_git_repositoryUrl=https://github.com/benas/spring-batch.git
CommonProgramW6432=C:\Program Files\Common Files
bamboo_repository_268501009_git_username=spring-buildmaster
bamboo_working_directory=C:\opt\bamboo-home\xml-data\build-dir\BATCH-BATCHWIN-JOB1
SystemRoot=C:\Windows
TEMP=C:\Users\bamboo\AppData\Local\Temp
USERPROFILE=C:\Users\bamboo
bamboo_planRepository_1_repositoryUrl=https://github.com/benas/spring-batch.git
TMP=C:\Users\bamboo\AppData\Local\Temp
bamboo_capability_system_jdk_JDK_1_8=C:\opt\jdk1.8.0_161
bamboo_capability_system_jdk_JDK_1_9=C:\opt\jdk-9.0.4
CommonProgramFiles(x86)=C:\Program Files (x86)\Common Files
WRAPPER_ARCH=x86
bamboo_sonatype_password=********
bamboo_capability_system_jdk_JDK_1_7=C:\opt\jdk1.7.0_80
bamboo_sonar_ip=10.194.6.9
Path=C:\Users\bamboo\AppData\Roaming
pm;C:\Users\bamboo\AppData\Roaming
pm
09-May-2019 14:52:34 Starting a Gradle Daemon (subsequent builds will be faster)
09-May-2019 14:52:50 Parallel execution is an incubating feature.
09-May-2019 14:52:50 > Task :buildSrc:compileJava NO-SOURCE
09-May-2019 14:52:52 > Task :buildSrc:compileGroovy
09-May-2019 14:52:52 > Task :buildSrc:processResources
09-May-2019 14:52:52 > Task :buildSrc:classes
09-May-2019 14:52:52 > Task :buildSrc:jar
09-May-2019 14:52:52 > Task :buildSrc:assemble
09-May-2019 14:52:52 > Task :buildSrc:compileTestJava NO-SOURCE
09-May-2019 14:52:52 > Task :buildSrc:compileTestGroovy NO-SOURCE
09-May-2019 14:52:52 > Task :buildSrc:processTestResources NO-SOURCE
09-May-2019 14:52:52 > Task :buildSrc:testClasses UP-TO-DATE
09-May-2019 14:52:52 > Task :buildSrc:test NO-SOURCE
09-May-2019 14:52:52 > Task :buildSrc:check UP-TO-DATE
09-May-2019 14:52:52 > Task :buildSrc:build
09-May-2019 14:52:56 Cannot publish pom for project ':' since it does not contain the Maven plugin install task and task ':artifactoryPublish' does not specify a custom pom path.
09-May-2019 14:52:56 Cannot publish pom for project ':spring-build-src' since it does not contain the Maven plugin install task and task ':spring-build-src:artifactoryPublish' does not specify a custom pom path.
09-May-2019 14:52:56 > Task :clean UP-TO-DATE
09-May-2019 14:52:56 > Task :spring-batch-infrastructure:clean UP-TO-DATE
09-May-2019 14:52:56 > Task :spring-batch-docs:clean UP-TO-DATE
09-May-2019 14:52:56 > Task :spring-batch-integration:clean UP-TO-DATE
09-May-2019 14:52:56 > Task :spring-batch-core-tests:clean UP-TO-DATE
09-May-2019 14:52:56 > Task :spring-batch-core:clean UP-TO-DATE
09-May-2019 14:52:56 > Task :spring-batch-infrastructure-tests:clean UP-TO-DATE
09-May-2019 14:52:56 > Task :spring-batch-samples:clean UP-TO-DATE
09-May-2019 14:52:56 > Task :spring-batch-test:clean UP-TO-DATE
09-May-2019 14:52:56 > Task :spring-build-src:clean
09-May-2019 14:52:57 > Task :spring-batch-integration:processResources
09-May-2019 14:52:57 > Task :schemaZip
09-May-2019 14:52:57 > Task :spring-batch-test:processResources
09-May-2019 14:52:57 > Task :spring-batch-integration:javadocJar
09-May-2019 14:52:57 > Task :spring-batch-test:javadocJar
09-May-2019 14:52:57 > Task :spring-batch-test:sourcesJar
09-May-2019 14:52:57 > Task :check UP-TO-DATE
09-May-2019 14:52:57 > Task :spring-batch-core-tests:processResources
09-May-2019 14:52:57 > Task :spring-batch-core-tests:javadocJar
09-May-2019 14:52:57 > Task :spring-batch-integration:sourcesJar
09-May-2019 14:52:57 > Task :spring-batch-core:processResources
09-May-2019 14:52:57 > Task :spring-batch-docs:compileJava NO-SOURCE
09-May-2019 14:52:57 > Task :spring-batch-docs:processResources NO-SOURCE
09-May-2019 14:52:57 > Task :spring-batch-docs:classes UP-TO-DATE
09-May-2019 14:52:57 > Task :spring-batch-core:javadocJar
09-May-2019 14:52:57 > Task :spring-batch-core-tests:sourcesJar
09-May-2019 14:52:57 > Task :spring-batch-core-tests:checkTestConfigs
09-May-2019 14:52:58 > Task :spring-batch-docs:jar
09-May-2019 14:52:58 > Task :spring-batch-docs:javadocJar
09-May-2019 14:52:58 > Task :spring-batch-docs:sourcesJar
09-May-2019 14:52:58 > Task :spring-batch-docs:assemble
09-May-2019 14:52:58 > Task :spring-batch-docs:checkTestConfigs
09-May-2019 14:52:58 > Task :spring-batch-docs:compileTestJava NO-SOURCE
09-May-2019 14:52:58 > Task :spring-batch-docs:processTestResources NO-SOURCE
09-May-2019 14:52:58 > Task :spring-batch-docs:testClasses UP-TO-DATE
09-May-2019 14:52:58 > Task :spring-batch-docs:test NO-SOURCE
09-May-2019 14:52:58 > Task :spring-batch-docs:check UP-TO-DATE
09-May-2019 14:52:58 > Task :spring-batch-docs:build
09-May-2019 14:52:58 > Task :spring-batch-infrastructure-tests:processResources NO-SOURCE
09-May-2019 14:52:58 > Task :spring-batch-core-tests:processTestResources
09-May-2019 14:52:58 > Task :spring-batch-integration:checkTestConfigs
09-May-2019 14:52:58 > Task :spring-batch-infrastructure-tests:javadocJar
09-May-2019 14:53:00 > Task :spring-batch-infrastructure-tests:sourcesJar
09-May-2019 14:53:00 > Task :spring-batch-infrastructure-tests:checkTestConfigs
09-May-2019 14:53:00 > Task :spring-batch-integration:processTestResources
09-May-2019 14:53:00 > Task :spring-batch-core:sourcesJar
09-May-2019 14:53:00 > Task :spring-batch-core:checkTestConfigs
09-May-2019 14:53:01 > Task :spring-batch-infrastructure-tests:processTestResources
09-May-2019 14:53:01 > Task :spring-batch-test:checkTestConfigs
09-May-2019 14:53:01 > Task :spring-batch-test:processTestResources
09-May-2019 14:53:01 > Task :spring-build-src:assemble UP-TO-DATE
09-May-2019 14:53:01 > Task :spring-build-src:compileJava NO-SOURCE
09-May-2019 14:53:02 > Task :spring-batch-samples:processResources
09-May-2019 14:53:02 > Task :spring-batch-samples:javadocJar
09-May-2019 14:53:02 > Task :spring-build-src:compileGroovy
09-May-2019 14:53:02 > Task :spring-build-src:processResources
09-May-2019 14:53:02 > Task :spring-build-src:classes
09-May-2019 14:53:02 > Task :spring-build-src:compileTestJava NO-SOURCE
09-May-2019 14:53:02 > Task :spring-build-src:compileTestGroovy NO-SOURCE
09-May-2019 14:53:02 > Task :spring-build-src:processTestResources NO-SOURCE
09-May-2019 14:53:02 > Task :spring-build-src:testClasses UP-TO-DATE
09-May-2019 14:53:02 > Task :spring-build-src:test NO-SOURCE
09-May-2019 14:53:02 > Task :spring-build-src:check UP-TO-DATE
09-May-2019 14:53:02 > Task :spring-build-src:build UP-TO-DATE
09-May-2019 14:53:02 > Task :spring-batch-docs:jacocoTestReport SKIPPED
09-May-2019 14:53:03 > Task :spring-batch-docs:install
09-May-2019 14:53:03 > Task :spring-batch-docs:artifactoryPublish
09-May-2019 14:53:03 > Task :spring-build-src:artifactoryPublish
09-May-2019 14:53:03 > Task :spring-batch-core:processTestResources
09-May-2019 14:53:03 > Task :spring-batch-samples:sourcesJar
09-May-2019 14:53:03 > Task :spring-batch-samples:checkTestConfigs
09-May-2019 14:53:03 > Task :spring-batch-samples:processTestResources
09-May-2019 14:53:17
09-May-2019 14:53:17 > Task :spring-batch-infrastructure:compileJava
09-May-2019 14:53:17 C:\opt\bamboo-home\xml-data\build-dir\BATCH-BATCHWIN-JOB1\spring-batch-infrastructure\src\main\java\org\springframework\batch\item\data\MongoItemReader.java:26: warning: [deprecation] JSON in com.mongodb.util has been deprecated
09-May-2019 14:53:17 import com.mongodb.util.JSON;
09-May-2019 14:53:17                        ^
09-May-2019 14:53:17 C:\opt\bamboo-home\xml-data\build-dir\BATCH-BATCHWIN-JOB1\spring-batch-infrastructure\src\main\java\org\springframework\batch\item\database\HibernateItemReaderHelper.java:23: warning: [deprecation] Query in org.hibernate has been deprecated
09-May-2019 14:53:17 import org.hibernate.Query;
09-May-2019 14:53:17                     ^
09-May-2019 14:53:18 C:\opt\bamboo-home\xml-data\build-dir\BATCH-BATCHWIN-JOB1\spring-batch-infrastructure\src\main\java\org\springframework\batch\item\data\MongoItemReader.java:264: warning: [deprecation] JSON in com.mongodb.util has been deprecated
09-May-2019 14:53:18                 return JSON.serialize(values.get(index));
09-May-2019 14:53:18                        ^
09-May-2019 14:53:18 C:\opt\bamboo-home\xml-data\build-dir\BATCH-BATCHWIN-JOB1\spring-batch-infrastructure\src\main\java\org\springframework\batch\item\data\builder\RepositoryItemWriterBuilder.java:43: warning: [rawtypes] found raw type: RepositoryMethodReference
09-May-2019 14:53:18         private RepositoryMethodReference repositoryMethodReference;
09-May-2019 14:53:18                 ^
09-May-2019 14:53:18   missing type arguments for generic class RepositoryMethodReference<T>
09-May-2019 14:53:18   where T is a type-variable:
09-May-2019 14:53:18     T extends Object declared in class RepositoryMethodReference
09-May-2019 14:53:18 C:\opt\bamboo-home\xml-data\build-dir\BATCH-BATCHWIN-JOB1\spring-batch-infrastructure\src\main\java\org\springframework\batch\item\data\builder\RepositoryItemWriterBuilder.java:90: warning: [rawtypes] found raw type: RepositoryMethodReference
09-May-2019 14:53:18         public RepositoryItemWriterBuilder<T> repository(RepositoryItemWriterBuilder.RepositoryMethodReference repositoryMethodReference) {
09-May-2019 14:53:18                                                                                     ^
09-May-2019 14:53:18   missing type arguments for generic class RepositoryMethodReference<T>
09-May-2019 14:53:18   where T is a type-variable:
09-May-2019 14:53:18     T extends Object declared in class RepositoryMethodReference
09-May-2019 14:53:18 C:\opt\bamboo-home\xml-data\build-dir\BATCH-BATCHWIN-JOB1\spring-batch-infrastructure\src\main\java\org\springframework\batch\item\data\builder\RepositoryItemWriterBuilder.java:104: warning: [unchecked] unchecked conversion
09-May-2019 14:53:18                         this.repository = this.repositoryMethodReference.getRepository();
09-May-2019 14:53:18                                                                                       ^
09-May-2019 14:53:18   required: CrudRepository<T,?>
09-May-2019 14:53:18   found:    CrudRepository
09-May-2019 14:53:18   where T is a type-variable:
09-May-2019 14:53:18     T extends Object declared in class RepositoryItemWriterBuilder
09-May-2019 14:53:18 C:\opt\bamboo-home\xml-data\build-dir\BATCH-BATCHWIN-JOB1\spring-batch-infrastructure\src\main\java\org\springframework\batch\item\database\HibernateItemReaderHelper.java:123: warning: [deprecation] Query in org.hibernate has been deprecated
09-May-2019 14:53:18                 Query query = createQuery();
09-May-2019 14:53:18                 ^
09-May-2019 14:53:18 C:\opt\bamboo-home\xml-data\build-dir\BATCH-BATCHWIN-JOB1\spring-batch-infrastructure\src\main\java\org\springframework\batch\item\database\HibernateItemReaderHelper.java:135: warning: [deprecation] Query in org.hibernate has been deprecated
09-May-2019 14:53:18         public Query createQuery() {
09-May-2019 14:53:18                ^
09-May-2019 14:53:18 C:\opt\bamboo-home\xml-data\build-dir\BATCH-BATCHWIN-JOB1\spring-batch-infrastructure\src\main\java\org\springframework\batch\item\database\HibernateItemReaderHelper.java:222: warning: [deprecation] Query in org.hibernate has been deprecated
09-May-2019 14:53:18                 Query query = createQuery();
09-May-2019 14:53:18                 ^
09-May-2019 14:53:21 9 warnings
09-May-2019 14:53:21
09-May-2019 14:53:21 > Task :spring-batch-infrastructure:processResources NO-SOURCE
09-May-2019 14:53:21 > Task :spring-batch-infrastructure:classes
09-May-2019 14:53:22 > Task :spring-batch-infrastructure:jar
09-May-2019 14:53:22 > Task :spring-batch-infrastructure:javadocJar
09-May-2019 14:53:22 > Task :spring-batch-infrastructure:sourcesJar
09-May-2019 14:53:22 > Task :spring-batch-infrastructure:assemble
09-May-2019 14:53:22 > Task :spring-batch-infrastructure:checkTestConfigs
09-May-2019 14:53:23 > Task :spring-batch-infrastructure-tests:compileJava
09-May-2019 14:53:23 > Task :spring-batch-infrastructure-tests:classes
09-May-2019 14:53:23 > Task :spring-batch-infrastructure-tests:jar
09-May-2019 14:53:23 > Task :spring-batch-infrastructure-tests:assemble
09-May-2019 14:53:24 C:\opt\bamboo-home\xml-data\build-dir\BATCH-BATCHWIN-JOB1\spring-batch-core\src\main\java\org\springframework\batch\core\configuration\support\AbstractApplicationContextFactory.java:34: warning: [deprecation] PropertyPlaceholderConfigurer in org.springframework.beans.factory.config has been deprecated
09-May-2019 14:53:24
09-May-2019 14:53:24 > Task :spring-batch-core:compileJava
09-May-2019 14:53:24 import org.springframework.beans.factory.config.PropertyPlaceholderConfigurer;
09-May-2019 14:53:24                                                ^
09-May-2019 14:53:24 C:\opt\bamboo-home\xml-data\build-dir\BATCH-BATCHWIN-JOB1\spring-batch-core\src\main\java\org\springframework\batch\core\configuration\support\ClasspathXmlApplicationContextsFactoryBean.java:27: warning: [deprecation] PropertyPlaceholderConfigurer in org.springframework.beans.factory.config has been deprecated
09-May-2019 14:53:24 import org.springframework.beans.factory.config.PropertyPlaceholderConfigurer;
09-May-2019 14:53:24                                                ^
09-May-2019 14:53:25 C:\opt\bamboo-home\xml-data\build-dir\BATCH-BATCHWIN-JOB1\spring-batch-core\src\main\java\org\springframework\batch\core\step\builder\SimpleStepBuilder.java:232: warning: [overloads] processor(ItemProcessor<? super I,? extends O>) in SimpleStepBuilder is potentially ambiguous with processor(Function<? super I,? extends O>) in SimpleStepBuilder
09-May-2019 14:53:25         public SimpleStepBuilder<I, O> processor(ItemProcessor<? super I, ? extends O> processor) {
09-May-2019 14:53:25                                        ^
09-May-2019 14:53:25   where I,O are type-variables:
09-May-2019 14:53:25     I extends Object declared in class SimpleStepBuilder
09-May-2019 14:53:25     O extends Object declared in class SimpleStepBuilder
09-May-2019 14:53:26 C:\opt\bamboo-home\xml-data\build-dir\BATCH-BATCHWIN-JOB1\spring-batch-core\src\main\java\org\springframework\batch\core\configuration\support\AbstractApplicationContextFactory.java:75: warning: [deprecation] PropertyPlaceholderConfigurer in org.springframework.beans.factory.config has been deprecated
09-May-2019 14:53:26                 beanFactoryPostProcessorClasses.add(PropertyPlaceholderConfigurer.class);
09-May-2019 14:53:26                                                     ^
09-May-2019 14:53:27 C:\opt\bamboo-home\xml-data\build-dir\BATCH-BATCHWIN-JOB1\spring-batch-core\src\main\java\org\springframework\batch\core\jsr\configuration\support\SpringAutowiredAnnotationBeanPostProcessor.java:264: warning: [deprecation] postProcessPropertyValues(PropertyValues,PropertyDescriptor[],Object,String) in InstantiationAwareBeanPostProcessorAdapter has been deprecated
09-May-2019 14:53:27     public PropertyValues postProcessPropertyValues(
09-May-2019 14:53:27                           ^
09-May-2019 14:53:30
09-May-2019 14:53:30 > Task :spring-batch-infrastructure-tests:compileTestJava
09-May-2019 14:53:30 > Task :spring-batch-infrastructure-tests:testClasses
09-May-2019 14:53:30 > Task :spring-batch-infrastructure-tests:test SKIPPED
09-May-2019 14:53:30 > Task :spring-batch-infrastructure-tests:check UP-TO-DATE
09-May-2019 14:53:30 > Task :spring-batch-infrastructure-tests:build
09-May-2019 14:53:30 > Task :spring-batch-infrastructure-tests:jacocoTestReport SKIPPED
09-May-2019 14:53:30 > Task :spring-batch-infrastructure-tests:install
09-May-2019 14:53:30 > Task :spring-batch-infrastructure-tests:artifactoryPublish SKIPPED
09-May-2019 14:53:31
09-May-2019 14:53:31 > Task :spring-batch-core:compileJava
09-May-2019 14:53:31 5 warnings
09-May-2019 14:53:31
09-May-2019 14:53:31 > Task :spring-batch-core:classes
09-May-2019 14:53:31 > Task :spring-batch-core:jar
09-May-2019 14:53:31 > Task :spring-batch-core:assemble
09-May-2019 14:53:32 C:\Users\bamboo\.gradle\caches\modules-2\files-2.1\org.springframework\spring-core\5.2.0.M1\f283c11f0767dabedd42b74e476c0348cede0868\spring-core-5.2.0.M1.jar(org/springframework/lang/Nullable.class): warning: Cannot find annotation method 'when()' in type 'Nonnull': class file for javax.annotation.Nonnull not found
09-May-2019 14:53:32 warning: unknown enum constant When.MAYBE
09-May-2019 14:53:32   reason: class file for javax.annotation.meta.When not found
09-May-2019 14:53:32 C:\Users\bamboo\.gradle\caches\modules-2\files-2.1\org.springframework\spring-core\5.2.0.M1\f283c11f0767dabedd42b74e476c0348cede0868\spring-core-5.2.0.M1.jar(org/springframework/lang/NonNullApi.class): warning: Cannot find annotation method 'value()' in type 'TypeQualifierDefault': class file for javax.annotation.meta.TypeQualifierDefault not found
09-May-2019 14:53:32 3 warnings
09-May-2019 14:53:33
09-May-2019 14:53:33 > Task :spring-batch-test:compileJava
09-May-2019 14:53:33
09-May-2019 14:53:33 > Task :spring-batch-test:classes
09-May-2019 14:53:33 > Task :spring-batch-test:jar
09-May-2019 14:53:33 > Task :spring-batch-integration:compileJava
09-May-2019 14:53:33 > Task :spring-batch-integration:classes
09-May-2019 14:53:33 > Task :spring-batch-core-tests:compileJava
09-May-2019 14:53:33 > Task :spring-batch-core-tests:classes
09-May-2019 14:53:33 > Task :spring-batch-core-tests:jar
09-May-2019 14:53:33 > Task :spring-batch-core-tests:assemble
09-May-2019 14:53:35 > Task :spring-batch-core-tests:compileTestJava
09-May-2019 14:53:35 > Task :spring-batch-core-tests:testClasses
09-May-2019 14:53:35 > Task :spring-batch-core-tests:test SKIPPED
09-May-2019 14:53:35 > Task :spring-batch-core-tests:check UP-TO-DATE
09-May-2019 14:53:35 > Task :spring-batch-core-tests:build
09-May-2019 14:53:35 > Task :spring-batch-test:assemble
09-May-2019 14:53:36 > Task :spring-batch-test:compileTestJava
09-May-2019 14:53:36 > Task :spring-batch-test:testClasses
09-May-2019 14:53:36 > Task :spring-batch-infrastructure:compileTestJava
09-May-2019 14:53:37 > Task :spring-batch-integration:jar
09-May-2019 14:53:38 > Task :spring-batch-infrastructure:processTestResources
09-May-2019 14:53:38 > Task :spring-batch-infrastructure:testClasses
09-May-2019 14:53:51 > Task :spring-batch-test:test
09-May-2019 14:53:51 > Task :spring-batch-integration:assemble
09-May-2019 14:53:58 > Task :spring-batch-integration:compileTestJava
09-May-2019 14:53:58 > Task :spring-batch-integration:testClasses
09-May-2019 14:54:01 > Task :spring-batch-core:compileTestJava
09-May-2019 14:54:04 > Task :spring-batch-core:testClasses
09-May-2019 14:54:07 > Task :api
09-May-2019 14:54:07 > Task :spring-batch-infrastructure:test
09-May-2019 14:54:28 > Task :spring-batch-integration:test
09-May-2019 14:54:35
09-May-2019 14:54:35 > Task :spring-batch-core:test
09-May-2019 14:54:35
09-May-2019 14:54:36 org.springframework.batch.core.configuration.xml.SplitInterruptedJobParserTests > testSplitInterrupted FAILED
09-May-2019 14:54:36     java.lang.AssertionError at SplitInterruptedJobParserTests.java:61
09-May-2019 14:54:37
09-May-2019 14:54:37 > Task :api
09-May-2019 14:54:38 C:\opt\bamboo-home\xml-data\build-dir\BATCH-BATCHWIN-JOB1\spring-batch-core\src\main\java\org\springframework\batch\core\metrics\BatchMetrics.java:67: warning - Tag @link: reference not found: Timer.Sample
09-May-2019 14:54:38 C:\opt\bamboo-home\xml-data\build-dir\BATCH-BATCHWIN-JOB1\spring-batch-core\src\main\java\org\springframework\batch\core\metrics\BatchMetrics.java:67: warning - Tag @link: reference not found: Timer.Sample
09-May-2019 14:55:05
09-May-2019 14:55:05 > Task :spring-batch-core:test
09-May-2019 14:55:05
09-May-2019 14:55:05 org.springframework.batch.core.jsr.configuration.xml.JsrSplitParsingTests > test FAILED
09-May-2019 14:55:05     java.lang.AssertionError at JsrSplitParsingTests.java:49
09-May-2019 14:55:08 C:\opt\bamboo-home\xml-data\build-dir\BATCH-BATCHWIN-JOB1\spring-batch-core\src\main\java\org\springframework\batch\core\metrics\BatchMetrics.java:67: warning - Tag @link: reference not found: Timer.Sample
09-May-2019 14:55:08
09-May-2019 14:55:08 > Task :api
09-May-2019 14:55:09
09-May-2019 14:55:09 > Task :docsZip
09-May-2019 14:55:10 > Task :distZip
09-May-2019 14:55:10 > Task :assemble
09-May-2019 14:55:10 > Task :build
09-May-2019 14:55:12 > Task :spring-batch-samples:compileJava
09-May-2019 14:55:12 > Task :spring-batch-samples:classes
09-May-2019 14:55:13 > Task :spring-batch-samples:jar
09-May-2019 14:55:13 > Task :spring-batch-samples:assemble
09-May-2019 14:55:20 > Task :spring-batch-samples:compileTestJava
09-May-2019 14:55:20 > Task :spring-batch-samples:testClasses
09-May-2019 14:55:22 > Task :spring-batch-integration:check
09-May-2019 14:55:22 > Task :spring-batch-integration:build
09-May-2019 14:55:22 > Task :spring-batch-test:check
09-May-2019 14:55:22 > Task :spring-batch-test:build
09-May-2019 14:55:22 > Task :spring-batch-core-tests:jacocoTestReport SKIPPED
09-May-2019 14:55:27 > Task :spring-batch-integration:jacocoTestReport
09-May-2019 14:55:29 > Task :spring-batch-test:jacocoTestReport
09-May-2019 14:55:31
09-May-2019 14:55:31 > Task :runTck
09-May-2019 14:55:31 Using the JSR 352 TCK at: 'C:\opt\jsr352-tck-1.0'
09-May-2019 14:55:39
09-May-2019 14:55:39 > Task :spring-batch-core:test
09-May-2019 14:55:39
09-May-2019 14:55:39 1903 tests completed, 2 failed, 7 skipped
09-May-2019 14:55:42
09-May-2019 14:55:42 > Task :spring-batch-infrastructure:check
09-May-2019 14:55:42 > Task :spring-batch-infrastructure:build
09-May-2019 14:55:48 > Task :spring-batch-core:test FAILED
09-May-2019 14:55:50 > Task :spring-batch-samples:test
09-May-2019 14:55:54 > Task :spring-batch-infrastructure:jacocoTestReport
09-May-2019 14:57:50 > Task :artifactoryDeploy
09-May-2019 14:57:50 88 actionable tasks: 79 executed, 9 up-to-date
09-May-2019 14:57:50
09-May-2019 14:57:50 FAILURE: Build failed with an exception.
09-May-2019 14:57:50
09-May-2019 14:57:50 * What went wrong:
09-May-2019 14:57:50 Execution failed for task ':spring-batch-core:test'.
09-May-2019 14:57:50 > There were failing tests. See the report at: file:///C:/opt/bamboo-home/xml-data/build-dir/BATCH-BATCHWIN-JOB1/spring-batch-core/build/reports/tests/test/index.html
09-May-2019 14:57:50
09-May-2019 14:57:50 * Try:
09-May-2019 14:57:50 Run with --stacktrace option to get the stack trace. Run with --info or --debug option to get more log output. Run with --scan to get full insights.
09-May-2019 14:57:50
09-May-2019 14:57:50 * Get more help at https://help.gradle.org
09-May-2019 14:57:50
09-May-2019 14:57:50 BUILD FAILED in 5m 21s
09-May-2019 14:57:51
09-May-2019 14:57:51 Failing task since return code of [./gradlew.bat -x javadoc -x asciidoc -x makePDF --parallel clean build jacocoTestReport runTck -I C:\Users\bamboo\AppData\Local\Temp\artifactory.init.script3195146972355040066gradle -DbuildInfoConfig.propertiesFile=C:\Users\bamboo\AppData\Local\Temp\buildinfo626999526521246011properties artifactoryPublish -Dartifactory.resolve.password=******** -Dartifactory.publish.password=********] was 1 while expected 0
09-May-2019 14:57:51 Parsing test results under C:\opt\bamboo-home\xml-data\build-dir\BATCH-BATCHWIN-JOB1...
09-May-2019 14:57:52 Finished task 'Gradle build' with result: Failed
09-May-2019 14:57:52 Running post build plugin 'Docker Container Cleanup'
09-May-2019 14:57:52 Running post build plugin 'NCover Results Collector'
09-May-2019 14:57:52 Running post build plugin 'Artifactory Release Management Staging'
09-May-2019 14:57:52 Running post build plugin 'Artifactory Build Info Copier'
09-May-2019 14:57:52 Running post build plugin 'Artifactory Gradle Properties Info Copier'
09-May-2019 14:57:52 Running post build plugin 'Clover Results Collector'
09-May-2019 14:57:52 Running post build plugin 'npm Cache Cleanup'
09-May-2019 14:57:52 Running post build plugin 'Artifact Copier'
09-May-2019 14:57:52 Publishing an artifact: Test Results
09-May-2019 14:57:52 Finished publishing of artifact Job artifact: [Test Results], pattern: [*/build/reports/tests/**/*.*] in 392.2 ms
09-May-2019 14:57:52 Publishing an artifact: Coverage Report
09-May-2019 14:57:53 Finished publishing of artifact Job artifact: [Coverage Report], pattern: [*/build/reports/jacoco/test/html/**/*.*] in 488.0 ms
09-May-2019 14:57:55 Successfully removed working directory at 'C:\opt\bamboo-home\xml-data\build-dir\BATCH-BATCHWIN-JOB1'
09-May-2019 14:57:55 Finalising the build...
09-May-2019 14:57:55 Stopping timer.
09-May-2019 14:57:55 Build BATCH-BATCHWIN-JOB1-124 completed.
09-May-2019 14:57:55 Running on server: post build plugin 'NCover Results Collector'
09-May-2019 14:57:55 Running on server: post build plugin 'Build Hanging Detection Configuration'
09-May-2019 14:57:55 Running on server: post build plugin 'Clover Delta Calculator'
09-May-2019 14:57:55 Running on server: post build plugin 'Maven Dependencies Postprocessor'
09-May-2019 14:57:55 All post build plugins have finished
09-May-2019 14:57:55 Generating build results summary...
09-May-2019 14:57:58 Saving build results to disk...
09-May-2019 14:57:58 Logging substituted variables...
09-May-2019 14:57:58 Indexing build results...
09-May-2019 14:57:58 Finished building BATCH-BATCHWIN-JOB1-124.