Build #125

Build plan for MS Windows

Build: #125 failed

Job: Default Job failed

Stages & jobs

  1. Default Stage

Test results

  • 3,738 tests in total
  • 2 tests failed
  • 2 failures are new
  • 2 tests were fixed
  • 10 tests were quarantined / skipped
  • 4 minutes taken in total.

Build 125 has the following 2 errors: 2 new failure(s) occurred since the previous build.

New test failures 2
Status Test Duration
Collapse Failed DecisionStepTests testDecisionAfterSplit History
< 1 sec
java.lang.AssertionError: java.lang.AssertionError: expected:<COMPLETED> but was:<FAILED>
java.lang.AssertionError: expected:<COMPLETED> but was:<FAILED>
	at org.junit.Assert.fail(Assert.java:88)
	at org.junit.Assert.failNotEquals(Assert.java:834)
	at org.junit.Assert.assertEquals(Assert.java:118)
	at org.junit.Assert.assertEquals(Assert.java:144)
	at org.springframework.batch.core.jsr.step.DecisionStepTests.testDecisionAfterSplit(DecisionStepTests.java:111)
	at sun.reflect.NativeMethodAccessorImpl.invoke0(Native Method)
(45 more lines...)
Collapse Failed KafkaItemReaderTests testReadFromMultiplePartitionsAfterRestart History
3 secs
java.lang.AssertionError: java.lang.AssertionError: 
Expected: iterable over ["val4", "val6", "val7"] in any order
     but: Not matched: null
java.lang.AssertionError: 
Expected: iterable over ["val4", "val6", "val7"] in any order
     but: Not matched: null
	at org.hamcrest.MatcherAssert.assertThat(MatcherAssert.java:20)
	at org.junit.Assert.assertThat(Assert.java:956)
(51 more lines...)