Build #128

Build plan for MS Windows

Build: #128 failed

Job: Default Job failed

Stages & jobs

  1. Default Stage

Build log

The build generated 355 lines of output. Download or view full build log

13-May-2019 21:44:09 Build Spring Batch - Windows - Default Job #128 (BATCH-BATCHWIN-JOB1-128) started building on agent bamboo-2k16-00
13-May-2019 21:44:09 Remote agent on host bamboo-2k6-00
13-May-2019 21:44:09 Build working directory is C:\opt\bamboo-home\xml-data\build-dir\BATCH-BATCHWIN-JOB1
13-May-2019 21:44:09 Executing build Spring Batch - Windows - Default Job #128 (BATCH-BATCHWIN-JOB1-128)
13-May-2019 21:44:09 Starting task 'Checkout Default Repository' of type 'com.atlassian.bamboo.plugins.vcs:task.vcs.checkout'
13-May-2019 21:44:09 Build always requires a clean checkout
13-May-2019 21:44:09 Cleaning build directory 'C:\opt\bamboo-home\xml-data\build-dir\BATCH-BATCHWIN-JOB1'
13-May-2019 21:44:09 Checking out into C:\opt\bamboo-home\xml-data\build-dir\BATCH-BATCHWIN-JOB1
13-May-2019 21:44:09 Updating source code to revision: 9135423424fe9a608446f70c4584219ae212d84f
13-May-2019 21:44:09 Creating local git repository in 'C:\opt\bamboo-home\xml-data\build-dir\BATCH-BATCHWIN-JOB1\.git'.
13-May-2019 21:44:09 Initialized empty Git repository in C:/opt/bamboo-home/xml-data/build-dir/BATCH-BATCHWIN-JOB1/.git/
13-May-2019 21:44:10 Fetching 'refs/heads/master' from 'https://github.com/benas/spring-batch.git'.
13-May-2019 21:44:15 From https://github.com/benas/spring-batch
13-May-2019 21:44:15 * [new branch]          master     -> master
13-May-2019 21:44:15 * [new tag]             2.2.0.M1      -> 2.2.0.M1
13-May-2019 21:44:15 * [new tag]             2.2.0.RC1     -> 2.2.0.RC1
13-May-2019 21:44:15 * [new tag]             2.2.0.RC2     -> 2.2.0.RC2
13-May-2019 21:44:15 * [new tag]             2.2.0.RELEASE -> 2.2.0.RELEASE
13-May-2019 21:44:15 * [new tag]             2.2.1.RELEASE -> 2.2.1.RELEASE
13-May-2019 21:44:15 * [new tag]             3.0.0.M1      -> 3.0.0.M1
13-May-2019 21:44:15 * [new tag]             3.0.0.M2      -> 3.0.0.M2
13-May-2019 21:44:15 * [new tag]             3.0.0.M3      -> 3.0.0.M3
13-May-2019 21:44:15 Checking out revision 9135423424fe9a608446f70c4584219ae212d84f.
13-May-2019 21:44:17 Already on 'master'
13-May-2019 21:44:17 Updated source code to revision: 9135423424fe9a608446f70c4584219ae212d84f
13-May-2019 21:44:17 Finished task 'Checkout Default Repository' with result: Success
13-May-2019 21:44:17 Running pre-build action: Artifactory Release Staging
13-May-2019 21:44:17 Running pre-build action: VCS Version Collector
13-May-2019 21:44:17 Starting task 'Gradle build' of type 'org.jfrog.bamboo.bamboo-artifactory-plugin:artifactoryGradleTask'
13-May-2019 21:44:17 Bamboo Artifactory Plugin version: 2.5.x-SNAPSHOT
13-May-2019 21:44:17
Beginning to execute external process for build 'Spring Batch - Windows - Default Job #128 (BATCH-BATCHWIN-JOB1-128)'
... running command line:
./gradlew.bat -x javadoc -x asciidoc -x makePDF --parallel clean build jacocoTestReport runTck -I C:\Users\bamboo\AppData\Local\Temp\artifactory.init.script5608353907445099023gradle -DbuildInfoConfig.propertiesFile=C:\Users\bamboo\AppData\Local\Temp\buildinfo6759076966263130647properties artifactoryPublish -Dartifactory.resolve.password=******** -Dartifactory.publish.password=********
... in: C:\opt\bamboo-home\xml-data\build-dir\BATCH-BATCHWIN-JOB1
... using extra environment variables:
bamboo_planRepository_1_branch=master
bamboo_********_username_password=********
bamboo_signing_store_password=********
bamboo_capability_system_builder_ant_Ant_1_9=C:\opt\apache-ant-1.9.9
bamboo_capability_system_builder_ant_Ant_1_8=C:\opt\apache-ant-1.8.4
bamboo_planRepository_1_branchDisplayName=master
bamboo_repository_revision_number=9135423424fe9a608446f70c4584219ae212d84f
ALLUSERSPROFILE=C:\ProgramData
bamboo_capability_system_builder_node_Node_js_6=/usr/bin/node
bamboo_RIAK_BIN=/usr/sbin/riak
bamboo_repository_268501009_git_repositoryUrl=https://github.com/benas/spring-batch.git
WRAPPER_BITS=64
bamboo_capability_system_builder_node_Node_js_8=C:\Program Files
odejs
ode.exe
bamboo_buildKey=BATCH-BATCHWIN-JOB1
SystemDrive=C:
bamboo_bintray_password=********
USERNAME=SYSTEM
bamboo_repository_268501009_revision_number=9135423424fe9a608446f70c4584219ae212d84f
bamboo_sonar_token_password=********
ProgramFiles(x86)=C:\Program Files (x86)
bamboo_shortJobName=Default Job
bamboo_capability_system_builder_gradle___gradlew=./gradlew
bamboo_buildResultsUrl=https://build.spring.io/browse/BATCH-BATCHWIN-JOB1-128
bamboo_capability_system_builder_mvn3_Maven_3_3=C:\opt\apache-maven-3.3.9
bamboo_capability_system_builder_mvn3_Maven_3_2=C:\opt\apache-maven-3.2.5
bamboo_capability_system_builder_mvn3_Maven_3_1=C:\opt/apache-maven-3.1.1
bamboo_planRepository_repositoryUrl=https://github.com/benas/spring-batch.git
PATHEXT=.COM;.EXE;.BAT;.CMD;.VBS;.VBE;.JS;.JSE;.WSF;.WSH;.MSC
bamboo_agentId=245596161
bamboo_capability_system_builder_mvn3_Maven_3_5=C:\opt\apache-maven-3.5.0
bamboo_capability_system_builder_mvn3_Maven_3_0=C:\opt\apache-maven-3.0.5
bamboo_planRepository_revision=9135423424fe9a608446f70c4584219ae212d84f
bamboo_planRepository_previousRevision=b2e0d1e2099ca47a6c15a201f112f6cf3b07c87d
PROCESSOR_IDENTIFIER=Intel64 Family 6 Model 85 Stepping 4, GenuineIntel
bamboo_capability_remote_build=true
bamboo_repository_branch_name=master
ProgramFiles=C:\Program Files
PUBLIC=C:\Users\Public
windir=C:\Windows
bamboo_sonatype_token_password=********
bamboo_scdf_acceptance_tests_password=********
WRAPPER_OS=windows
JAVA_HOME=C:\opt\jdk1.8.0_161\
bamboo_repository_268501009_previous_revision_number=b2e0d1e2099ca47a6c15a201f112f6cf3b07c87d
bamboo_planRepository_branch=master
=C:=C:\opt\bamboo-home\bin
APPDATA=C:\Users\bamboo\AppData\Roaming
bamboo_planRepository_1_type=gitv2
bamboo_planRepository_branchName=master
WRAPPER_FILE_SEPARATOR=\
bamboo_capability_system_builder_ant_Ant_1_10=C:\opt\apache-ant-1.10.1
COMPUTERNAME=WIN-TV86RA8UDK1
WRAPPER_PATH_SEPARATOR=;
bamboo_sonar_password=********
bamboo_hg_cache_directory=C:\opt\bamboo-home\xml-data\build-dir\_hg-repositories-cache
bamboo_planRepository_1_username=spring-buildmaster
bamboo_planRepository_type=gitv2
bamboo_repository_268501009_name=Git
bamboo_git_cache_directory=C:\opt\bamboo-home\xml-data\build-dir\_git-repositories-cache
ComSpec=C:\Windows\system32\cmd.exe
bamboo_artifactory_username=buildmaster
bamboo_tmp_directory=C:\opt\bamboo-home\temp
bamboo_planKey=BATCH-BATCHWIN
bamboo_planRepository_username=spring-buildmaster
bamboo_JDK8_HOME=/opt/jdk-8
NUMBER_OF_PROCESSORS=4
bamboo_planRepository_1_branchName=master
bamboo_sonar_version=5.6.3
PROCESSOR_LEVEL=6
bamboo_resultsUrl=https://build.spring.io/browse/BATCH-BATCHWIN-JOB1-128
PROCESSOR_ARCHITECTURE=AMD64
bamboo_build_working_directory=C:\opt\bamboo-home\xml-data\build-dir\BATCH-BATCHWIN-JOB1
bamboo_planRepository_1_name=Git
PSModulePath=C:\Program Files\WindowsPowerShell\Modules;C:\Windows\system32\WindowsPowerShell\v1.0\Modules
bamboo_capability_system_os=windows2016
bamboo_nexusPush_stagingProfile=buildmaster
bamboo_shortPlanName=Windows
bamboo_planRepository_name=Git
bamboo_repository_268501009_branch_name=master
bamboo_buildNumber=128
bamboo_planName=Spring Batch - Windows
bamboo_JDK7_HOME=/opt/jdk-7
bamboo_shortPlanKey=BATCHWIN
bamboo_shortJobKey=JOB1
bamboo_artifactory_password=********
bamboo_repository_268501009_git_branch=master
ProgramData=C:\ProgramData
ProgramW6432=C:\Program Files
bamboo_buildTimeStamp=2019-05-13T21:44:09.591Z
bamboo_repository_previous_revision_number=b2e0d1e2099ca47a6c15a201f112f6cf3b07c87d
bamboo_sonar_username=buildmaster
bamboo_********_password=********
bamboo_repository_git_branch=master
bamboo_buildResultKey=BATCH-BATCHWIN-JOB1-128
bamboo_nexusPush_close=true
bamboo_buildPlanName=Spring Batch - Windows - Default Job
bamboo_planRepository_1_revision=9135423424fe9a608446f70c4584219ae212d84f
LOCALAPPDATA=C:\Users\bamboo\AppData\Local
bamboo_repository_name=Git
bamboo_signing_key_password=********
USERDOMAIN=WIN-TV86RA8UDK1
bamboo_JSR_352_TCK_HOME="C:\opt\jsr352-tck-1.0"
JSR_352_TCK_HOME=C:\opt\jsr352-tck-1.0
bamboo_buildFailed=false
bamboo_capability_system_docker_executable=/usr/bin/docker
bamboo_artifactory_password_mask_b=********
bamboo_artifactory_password_mask_a=********
bamboo_agentWorkingDirectory=C:\opt\bamboo-home\xml-data\build-dir
bamboo_capability_system_git_executable=C:\Program Files\Git\bin\git.exe
bamboo_repository_git_username=spring-buildmaster
bamboo_planRepository_1_previousRevision=b2e0d1e2099ca47a6c15a201f112f6cf3b07c87d
bamboo_capability_os_family=windows
bamboo_planRepository_branchDisplayName=master
CommonProgramFiles=C:\Program Files\Common Files
bamboo_capability_system_builder_maven_Artifactory_Maven_3_5=C:\opt\apache-maven-3.5.0
bamboo_capability_system_builder_maven_Artifactory_Maven_3_3=C:\opt\apache-maven-3.3.9
bamboo_capability_system_builder_maven_Artifactory_Maven_3_2=C:\opt\apache-maven-3.2.5
bamboo_s3_properties=/home/bamboo/tools/s3.properties
OS=Windows_NT
bamboo_capability_system_builder_maven_Artifactory_Maven_3_1=C:\opt\apache-maven-3.1.1
bamboo_capability_system_builder_maven_Artifactory_Maven_3_0=C:\opt\apache-maven-3.0.5
bamboo_plan_storageTag=plan-268238890
bamboo_bintray_username_password=********
PROCESSOR_REVISION=5504
bamboo_repository_git_repositoryUrl=https://github.com/benas/spring-batch.git
CommonProgramW6432=C:\Program Files\Common Files
bamboo_repository_268501009_git_username=spring-buildmaster
bamboo_working_directory=C:\opt\bamboo-home\xml-data\build-dir\BATCH-BATCHWIN-JOB1
SystemRoot=C:\Windows
TEMP=C:\Users\bamboo\AppData\Local\Temp
USERPROFILE=C:\Users\bamboo
bamboo_planRepository_1_repositoryUrl=https://github.com/benas/spring-batch.git
TMP=C:\Users\bamboo\AppData\Local\Temp
bamboo_capability_system_jdk_JDK_1_8=C:\opt\jdk1.8.0_161
bamboo_capability_system_jdk_JDK_1_9=C:\opt\jdk-9.0.4
CommonProgramFiles(x86)=C:\Program Files (x86)\Common Files
WRAPPER_ARCH=x86
bamboo_sonatype_password=********
bamboo_capability_system_jdk_JDK_1_7=C:\opt\jdk1.7.0_80
bamboo_sonar_ip=10.194.6.9
Path=C:\Users\bamboo\AppData\Roaming
pm;C:\Users\bamboo\AppData\Roaming
pm
13-May-2019 21:44:23 Parallel execution is an incubating feature.
13-May-2019 21:44:23 > Task :buildSrc:compileJava NO-SOURCE
13-May-2019 21:44:37 > Task :buildSrc:compileGroovy
13-May-2019 21:44:37 > Task :buildSrc:processResources
13-May-2019 21:44:37 > Task :buildSrc:classes
13-May-2019 21:44:37 > Task :buildSrc:jar
13-May-2019 21:44:37 > Task :buildSrc:assemble
13-May-2019 21:44:37 > Task :buildSrc:compileTestJava NO-SOURCE
13-May-2019 21:44:37 > Task :buildSrc:compileTestGroovy NO-SOURCE
13-May-2019 21:44:37 > Task :buildSrc:processTestResources NO-SOURCE
13-May-2019 21:44:37 > Task :buildSrc:testClasses UP-TO-DATE
13-May-2019 21:44:37 > Task :buildSrc:test NO-SOURCE
13-May-2019 21:44:37 > Task :buildSrc:check UP-TO-DATE
13-May-2019 21:44:37 > Task :buildSrc:build
13-May-2019 21:44:39 Cannot publish pom for project ':spring-build-src' since it does not contain the Maven plugin install task and task ':spring-build-src:artifactoryPublish' does not specify a custom pom path.
13-May-2019 21:44:39 Cannot publish pom for project ':' since it does not contain the Maven plugin install task and task ':artifactoryPublish' does not specify a custom pom path.
13-May-2019 21:44:39 > Task :clean UP-TO-DATE
13-May-2019 21:44:39 > Task :spring-batch-core-tests:clean UP-TO-DATE
13-May-2019 21:44:39 > Task :spring-batch-infrastructure-tests:clean UP-TO-DATE
13-May-2019 21:44:39 > Task :spring-batch-integration:clean UP-TO-DATE
13-May-2019 21:44:39 > Task :spring-batch-samples:clean UP-TO-DATE
13-May-2019 21:44:39 > Task :spring-batch-test:clean UP-TO-DATE
13-May-2019 21:44:39 > Task :spring-batch-infrastructure:clean UP-TO-DATE
13-May-2019 21:44:39 > Task :spring-batch-docs:clean UP-TO-DATE
13-May-2019 21:44:39 > Task :spring-batch-core:clean UP-TO-DATE
13-May-2019 21:44:39 > Task :spring-build-src:clean
13-May-2019 21:44:39 > Task :spring-batch-integration:processResources
13-May-2019 21:44:39 > Task :spring-batch-integration:javadocJar
13-May-2019 21:44:39 > Task :schemaZip
13-May-2019 21:44:39 > Task :spring-batch-test:processResources
13-May-2019 21:44:39 > Task :spring-batch-test:javadocJar
13-May-2019 21:44:39 > Task :spring-batch-test:sourcesJar
13-May-2019 21:44:39 > Task :check UP-TO-DATE
13-May-2019 21:44:39 > Task :spring-batch-core:processResources
13-May-2019 21:44:39 > Task :spring-batch-core:javadocJar
13-May-2019 21:44:39 > Task :spring-batch-core-tests:processResources
13-May-2019 21:44:39 > Task :spring-batch-core-tests:javadocJar
13-May-2019 21:44:39 > Task :spring-batch-integration:sourcesJar
13-May-2019 21:44:39 > Task :spring-batch-docs:compileJava NO-SOURCE
13-May-2019 21:44:39 > Task :spring-batch-docs:processResources NO-SOURCE
13-May-2019 21:44:39 > Task :spring-batch-docs:classes UP-TO-DATE
13-May-2019 21:44:39 > Task :spring-batch-docs:jar
13-May-2019 21:44:39 > Task :spring-batch-docs:javadocJar
13-May-2019 21:44:39 > Task :spring-batch-docs:sourcesJar
13-May-2019 21:44:39 > Task :spring-batch-docs:assemble
13-May-2019 21:44:39 > Task :spring-batch-docs:checkTestConfigs
13-May-2019 21:44:39 > Task :spring-batch-docs:compileTestJava NO-SOURCE
13-May-2019 21:44:39 > Task :spring-batch-docs:processTestResources NO-SOURCE
13-May-2019 21:44:39 > Task :spring-batch-docs:testClasses UP-TO-DATE
13-May-2019 21:44:39 > Task :spring-batch-docs:test NO-SOURCE
13-May-2019 21:44:39 > Task :spring-batch-docs:check UP-TO-DATE
13-May-2019 21:44:39 > Task :spring-batch-docs:build
13-May-2019 21:44:39 > Task :spring-batch-infrastructure-tests:processResources NO-SOURCE
13-May-2019 21:44:39 > Task :spring-batch-infrastructure-tests:javadocJar
13-May-2019 21:44:39 > Task :spring-batch-core-tests:sourcesJar
13-May-2019 21:44:39 > Task :spring-batch-core-tests:checkTestConfigs
13-May-2019 21:44:40 > Task :spring-batch-core-tests:processTestResources
13-May-2019 21:44:40 > Task :spring-batch-integration:checkTestConfigs
13-May-2019 21:44:41 > Task :spring-batch-infrastructure-tests:sourcesJar
13-May-2019 21:44:41 > Task :spring-batch-infrastructure-tests:checkTestConfigs
13-May-2019 21:44:42 > Task :spring-batch-core:sourcesJar
13-May-2019 21:44:42 > Task :spring-batch-core:checkTestConfigs
13-May-2019 21:44:42 > Task :spring-batch-integration:processTestResources
13-May-2019 21:44:42 > Task :spring-batch-infrastructure-tests:processTestResources
13-May-2019 21:44:42 > Task :spring-batch-test:checkTestConfigs
13-May-2019 21:44:42 > Task :spring-batch-test:processTestResources
13-May-2019 21:44:42 > Task :spring-build-src:assemble UP-TO-DATE
13-May-2019 21:44:42 > Task :spring-build-src:compileJava NO-SOURCE
13-May-2019 21:44:42 > Task :spring-batch-samples:processResources
13-May-2019 21:44:42 > Task :spring-batch-samples:javadocJar
13-May-2019 21:44:43 > Task :spring-build-src:compileGroovy
13-May-2019 21:44:43 > Task :spring-build-src:processResources
13-May-2019 21:44:43 > Task :spring-build-src:classes
13-May-2019 21:44:43 > Task :spring-build-src:compileTestJava NO-SOURCE
13-May-2019 21:44:43 > Task :spring-build-src:compileTestGroovy NO-SOURCE
13-May-2019 21:44:43 > Task :spring-build-src:processTestResources NO-SOURCE
13-May-2019 21:44:43 > Task :spring-build-src:testClasses UP-TO-DATE
13-May-2019 21:44:43 > Task :spring-build-src:test NO-SOURCE
13-May-2019 21:44:43 > Task :spring-build-src:check UP-TO-DATE
13-May-2019 21:44:43 > Task :spring-build-src:build UP-TO-DATE
13-May-2019 21:44:43 > Task :spring-batch-docs:jacocoTestReport SKIPPED
13-May-2019 21:44:43 > Task :spring-batch-docs:install
13-May-2019 21:44:43 > Task :spring-batch-docs:artifactoryPublish
13-May-2019 21:44:43 > Task :spring-build-src:artifactoryPublish
13-May-2019 21:44:43 > Task :spring-batch-samples:sourcesJar
13-May-2019 21:44:43 > Task :spring-batch-samples:checkTestConfigs
13-May-2019 21:44:43 > Task :spring-batch-core:processTestResources
13-May-2019 21:44:44 > Task :spring-batch-samples:processTestResources
13-May-2019 21:45:00
13-May-2019 21:45:00 > Task :spring-batch-infrastructure:compileJava
13-May-2019 21:45:00 C:\opt\bamboo-home\xml-data\build-dir\BATCH-BATCHWIN-JOB1\spring-batch-infrastructure\src\main\java\org\springframework\batch\item\data\MongoItemReader.java:26: warning: [deprecation] JSON in com.mongodb.util has been deprecated
13-May-2019 21:45:00 import com.mongodb.util.JSON;
13-May-2019 21:45:00                        ^
13-May-2019 21:45:00 C:\opt\bamboo-home\xml-data\build-dir\BATCH-BATCHWIN-JOB1\spring-batch-infrastructure\src\main\java\org\springframework\batch\item\database\HibernateItemReaderHelper.java:23: warning: [deprecation] Query in org.hibernate has been deprecated
13-May-2019 21:45:00 import org.hibernate.Query;
13-May-2019 21:45:00                     ^
13-May-2019 21:45:01 C:\opt\bamboo-home\xml-data\build-dir\BATCH-BATCHWIN-JOB1\spring-batch-infrastructure\src\main\java\org\springframework\batch\item\data\MongoItemReader.java:264: warning: [deprecation] JSON in com.mongodb.util has been deprecated
13-May-2019 21:45:01                 return JSON.serialize(values.get(index));
13-May-2019 21:45:01                        ^
13-May-2019 21:45:01 C:\opt\bamboo-home\xml-data\build-dir\BATCH-BATCHWIN-JOB1\spring-batch-infrastructure\src\main\java\org\springframework\batch\item\data\builder\RepositoryItemWriterBuilder.java:43: warning: [rawtypes] found raw type: RepositoryMethodReference
13-May-2019 21:45:01         private RepositoryMethodReference repositoryMethodReference;
13-May-2019 21:45:01                 ^
13-May-2019 21:45:01   missing type arguments for generic class RepositoryMethodReference<T>
13-May-2019 21:45:01   where T is a type-variable:
13-May-2019 21:45:01     T extends Object declared in class RepositoryMethodReference
13-May-2019 21:45:01 C:\opt\bamboo-home\xml-data\build-dir\BATCH-BATCHWIN-JOB1\spring-batch-infrastructure\src\main\java\org\springframework\batch\item\data\builder\RepositoryItemWriterBuilder.java:90: warning: [rawtypes] found raw type: RepositoryMethodReference
13-May-2019 21:45:01         public RepositoryItemWriterBuilder<T> repository(RepositoryItemWriterBuilder.RepositoryMethodReference repositoryMethodReference) {
13-May-2019 21:45:01                                                                                     ^
13-May-2019 21:45:01   missing type arguments for generic class RepositoryMethodReference<T>
13-May-2019 21:45:01   where T is a type-variable:
13-May-2019 21:45:01     T extends Object declared in class RepositoryMethodReference
13-May-2019 21:45:01 C:\opt\bamboo-home\xml-data\build-dir\BATCH-BATCHWIN-JOB1\spring-batch-infrastructure\src\main\java\org\springframework\batch\item\data\builder\RepositoryItemWriterBuilder.java:104: warning: [unchecked] unchecked conversion
13-May-2019 21:45:01                         this.repository = this.repositoryMethodReference.getRepository();
13-May-2019 21:45:01                                                                                       ^
13-May-2019 21:45:01   required: CrudRepository<T,?>
13-May-2019 21:45:01   found:    CrudRepository
13-May-2019 21:45:01   where T is a type-variable:
13-May-2019 21:45:01     T extends Object declared in class RepositoryItemWriterBuilder
13-May-2019 21:45:01 C:\opt\bamboo-home\xml-data\build-dir\BATCH-BATCHWIN-JOB1\spring-batch-infrastructure\src\main\java\org\springframework\batch\item\database\HibernateItemReaderHelper.java:123: warning: [deprecation] Query in org.hibernate has been deprecated
13-May-2019 21:45:01                 Query query = createQuery();
13-May-2019 21:45:01                 ^
13-May-2019 21:45:01 C:\opt\bamboo-home\xml-data\build-dir\BATCH-BATCHWIN-JOB1\spring-batch-infrastructure\src\main\java\org\springframework\batch\item\database\HibernateItemReaderHelper.java:135: warning: [deprecation] Query in org.hibernate has been deprecated
13-May-2019 21:45:01         public Query createQuery() {
13-May-2019 21:45:01                ^
13-May-2019 21:45:01 C:\opt\bamboo-home\xml-data\build-dir\BATCH-BATCHWIN-JOB1\spring-batch-infrastructure\src\main\java\org\springframework\batch\item\database\HibernateItemReaderHelper.java:222: warning: [deprecation] Query in org.hibernate has been deprecated
13-May-2019 21:45:01                 Query query = createQuery();
13-May-2019 21:45:01                 ^
13-May-2019 21:45:02 C:\opt\bamboo-home\xml-data\build-dir\BATCH-BATCHWIN-JOB1\spring-batch-infrastructure\src\main\java\org\springframework\batch\item\kafka\KafkaItemReader.java:150: warning: [unchecked] unchecked cast
13-May-2019 21:45:02                         Map<TopicPartition, Long> offsets = (Map<TopicPartition, Long>) executionContext.get(TOPIC_PARTITION_OFFSETS);
13-May-2019 21:45:02                                                                                                             ^
13-May-2019 21:45:02   required: Map<TopicPartition,Long>
13-May-2019 21:45:02   found:    Object
13-May-2019 21:45:02 10 warnings
13-May-2019 21:45:02
13-May-2019 21:45:02 > Task :spring-batch-infrastructure:processResources NO-SOURCE
13-May-2019 21:45:02 > Task :spring-batch-infrastructure:classes
13-May-2019 21:45:03 > Task :spring-batch-infrastructure:jar
13-May-2019 21:45:03 > Task :spring-batch-infrastructure:javadocJar
13-May-2019 21:45:03 > Task :spring-batch-infrastructure:sourcesJar
13-May-2019 21:45:03 > Task :spring-batch-infrastructure:assemble
13-May-2019 21:45:03 > Task :spring-batch-infrastructure:checkTestConfigs
13-May-2019 21:45:04 > Task :spring-batch-infrastructure-tests:compileJava
13-May-2019 21:45:04 > Task :spring-batch-infrastructure-tests:classes
13-May-2019 21:45:04 > Task :spring-batch-infrastructure-tests:jar
13-May-2019 21:45:04 > Task :spring-batch-infrastructure-tests:assemble
13-May-2019 21:45:05
13-May-2019 21:45:05 > Task :spring-batch-core:compileJava
13-May-2019 21:45:05 C:\opt\bamboo-home\xml-data\build-dir\BATCH-BATCHWIN-JOB1\spring-batch-core\src\main\java\org\springframework\batch\core\configuration\support\AbstractApplicationContextFactory.java:34: warning: [deprecation] PropertyPlaceholderConfigurer in org.springframework.beans.factory.config has been deprecated
13-May-2019 21:45:05 import org.springframework.beans.factory.config.PropertyPlaceholderConfigurer;
13-May-2019 21:45:05                                                ^
13-May-2019 21:45:05 C:\opt\bamboo-home\xml-data\build-dir\BATCH-BATCHWIN-JOB1\spring-batch-core\src\main\java\org\springframework\batch\core\configuration\support\ClasspathXmlApplicationContextsFactoryBean.java:27: warning: [deprecation] PropertyPlaceholderConfigurer in org.springframework.beans.factory.config has been deprecated
13-May-2019 21:45:05 import org.springframework.beans.factory.config.PropertyPlaceholderConfigurer;
13-May-2019 21:45:05                                                ^
13-May-2019 21:45:05 C:\opt\bamboo-home\xml-data\build-dir\BATCH-BATCHWIN-JOB1\spring-batch-core\src\main\java\org\springframework\batch\core\step\builder\SimpleStepBuilder.java:232: warning: [overloads] processor(ItemProcessor<? super I,? extends O>) in SimpleStepBuilder is potentially ambiguous with processor(Function<? super I,? extends O>) in SimpleStepBuilder
13-May-2019 21:45:05         public SimpleStepBuilder<I, O> processor(ItemProcessor<? super I, ? extends O> processor) {
13-May-2019 21:45:05                                        ^
13-May-2019 21:45:05   where I,O are type-variables:
13-May-2019 21:45:05     I extends Object declared in class SimpleStepBuilder
13-May-2019 21:45:05     O extends Object declared in class SimpleStepBuilder
13-May-2019 21:45:05 C:\opt\bamboo-home\xml-data\build-dir\BATCH-BATCHWIN-JOB1\spring-batch-core\src\main\java\org\springframework\batch\core\configuration\support\AbstractApplicationContextFactory.java:75: warning: [deprecation] PropertyPlaceholderConfigurer in org.springframework.beans.factory.config has been deprecated
13-May-2019 21:45:05                 beanFactoryPostProcessorClasses.add(PropertyPlaceholderConfigurer.class);
13-May-2019 21:45:05                                                     ^
13-May-2019 21:45:05 C:\opt\bamboo-home\xml-data\build-dir\BATCH-BATCHWIN-JOB1\spring-batch-core\src\main\java\org\springframework\batch\core\jsr\configuration\support\SpringAutowiredAnnotationBeanPostProcessor.java:264: warning: [deprecation] postProcessPropertyValues(PropertyValues,PropertyDescriptor[],Object,String) in InstantiationAwareBeanPostProcessorAdapter has been deprecated
13-May-2019 21:45:05     public PropertyValues postProcessPropertyValues(
13-May-2019 21:45:05                           ^
13-May-2019 21:45:07 5 warnings
13-May-2019 21:45:07
13-May-2019 21:45:07 > Task :spring-batch-core:classes
13-May-2019 21:45:07 > Task :spring-batch-infrastructure-tests:compileTestJava
13-May-2019 21:45:07 > Task :spring-batch-infrastructure-tests:testClasses
13-May-2019 21:45:07 > Task :spring-batch-infrastructure-tests:test SKIPPED
13-May-2019 21:45:07 > Task :spring-batch-infrastructure-tests:check UP-TO-DATE
13-May-2019 21:45:07 > Task :spring-batch-infrastructure-tests:build
13-May-2019 21:45:07 > Task :spring-batch-infrastructure-tests:jacocoTestReport SKIPPED
13-May-2019 21:45:07 > Task :spring-batch-infrastructure-tests:install
13-May-2019 21:45:07 > Task :spring-batch-infrastructure-tests:artifactoryPublish SKIPPED
13-May-2019 21:45:07 > Task :spring-batch-core:jar
13-May-2019 21:45:07 > Task :spring-batch-core:assemble
13-May-2019 21:45:08
13-May-2019 21:45:08 > Task :spring-batch-test:compileJava
13-May-2019 21:45:08
13-May-2019 21:45:08 > Task :spring-batch-test:classes
13-May-2019 21:45:08 C:\Users\bamboo\.gradle\caches\modules-2\files-2.1\org.springframework\spring-core\5.2.0.M2\9a84d456ad8d5151da06fc8a85540da9cc95d734\spring-core-5.2.0.M2.jar(org/springframework/lang/Nullable.class): warning: Cannot find annotation method 'when()' in type 'Nonnull': class file for javax.annotation.Nonnull not found
13-May-2019 21:45:08 warning: unknown enum constant When.MAYBE
13-May-2019 21:45:08   reason: class file for javax.annotation.meta.When not found
13-May-2019 21:45:08 C:\Users\bamboo\.gradle\caches\modules-2\files-2.1\org.springframework\spring-core\5.2.0.M2\9a84d456ad8d5151da06fc8a85540da9cc95d734\spring-core-5.2.0.M2.jar(org/springframework/lang/NonNullApi.class): warning: Cannot find annotation method 'value()' in type 'TypeQualifierDefault': class file for javax.annotation.meta.TypeQualifierDefault not found
13-May-2019 21:45:08 3 warnings
13-May-2019 21:45:08 > Task :spring-batch-test:jar
13-May-2019 21:45:08 > Task :spring-batch-integration:compileJava
13-May-2019 21:45:08 > Task :spring-batch-integration:classes
13-May-2019 21:45:08 > Task :spring-batch-core-tests:compileJava
13-May-2019 21:45:08 > Task :spring-batch-core-tests:classes
13-May-2019 21:45:08 > Task :spring-batch-core-tests:jar
13-May-2019 21:45:08 > Task :spring-batch-core-tests:assemble
13-May-2019 21:45:09 > Task :spring-batch-core-tests:compileTestJava
13-May-2019 21:45:09 > Task :spring-batch-core-tests:testClasses
13-May-2019 21:45:09 > Task :spring-batch-core-tests:test SKIPPED
13-May-2019 21:45:09 > Task :spring-batch-core-tests:check UP-TO-DATE
13-May-2019 21:45:09 > Task :spring-batch-core-tests:build
13-May-2019 21:45:09 > Task :spring-batch-test:assemble
13-May-2019 21:45:10 > Task :spring-batch-test:compileTestJava
13-May-2019 21:45:10 > Task :spring-batch-test:testClasses
13-May-2019 21:45:10 > Task :spring-batch-integration:jar
13-May-2019 21:45:13 > Task :spring-batch-infrastructure:compileTestJava
13-May-2019 21:45:14 > Task :spring-batch-infrastructure:processTestResources
13-May-2019 21:45:14 > Task :spring-batch-infrastructure:testClasses
13-May-2019 21:45:26 > Task :spring-batch-test:test
13-May-2019 21:45:26 > Task :spring-batch-integration:assemble
13-May-2019 21:45:27 > Task :spring-batch-core:compileTestJava
13-May-2019 21:45:27 > Task :spring-batch-core:testClasses
13-May-2019 21:45:36 > Task :spring-batch-integration:compileTestJava
13-May-2019 21:45:36 > Task :spring-batch-integration:testClasses
13-May-2019 21:45:41 > Task :api
13-May-2019 21:45:44 > Task :spring-batch-infrastructure:test
13-May-2019 21:45:57 > Task :spring-batch-core:test
13-May-2019 21:46:06 > Task :spring-batch-integration:test
13-May-2019 21:46:11
13-May-2019 21:46:11 > Task :api
13-May-2019 21:46:11 C:\opt\bamboo-home\xml-data\build-dir\BATCH-BATCHWIN-JOB1\spring-batch-core\src\main\java\org\springframework\batch\core\metrics\BatchMetrics.java:67: warning - Tag @link: reference not found: Timer.Sample
13-May-2019 21:46:11 C:\opt\bamboo-home\xml-data\build-dir\BATCH-BATCHWIN-JOB1\spring-batch-core\src\main\java\org\springframework\batch\core\metrics\BatchMetrics.java:67: warning - Tag @link: reference not found: Timer.Sample
13-May-2019 21:46:27
13-May-2019 21:46:27 > Task :spring-batch-core:test
13-May-2019 21:46:27
13-May-2019 21:46:27 org.springframework.batch.core.jsr.configuration.xml.JsrSplitParsingTests > test FAILED
13-May-2019 21:46:27     java.lang.AssertionError at JsrSplitParsingTests.java:49
13-May-2019 21:46:41 C:\opt\bamboo-home\xml-data\build-dir\BATCH-BATCHWIN-JOB1\spring-batch-core\src\main\java\org\springframework\batch\core\metrics\BatchMetrics.java:67: warning - Tag @link: reference not found: Timer.Sample
13-May-2019 21:46:41
13-May-2019 21:46:41 > Task :api
13-May-2019 21:46:43
13-May-2019 21:46:43 > Task :docsZip
13-May-2019 21:46:44 > Task :distZip
13-May-2019 21:46:44 > Task :assemble
13-May-2019 21:46:44 > Task :build
13-May-2019 21:46:46 > Task :spring-batch-samples:compileJava
13-May-2019 21:46:46 > Task :spring-batch-samples:classes
13-May-2019 21:46:46 > Task :spring-batch-samples:jar
13-May-2019 21:46:46 > Task :spring-batch-samples:assemble
13-May-2019 21:46:50 > Task :spring-batch-samples:compileTestJava
13-May-2019 21:46:50 > Task :spring-batch-samples:testClasses
13-May-2019 21:46:53
13-May-2019 21:46:53 > Task :spring-batch-infrastructure:test
13-May-2019 21:46:53
13-May-2019 21:46:53 org.springframework.batch.item.kafka.KafkaItemReaderTests > testReadFromMultiplePartitionsAfterRestart FAILED
13-May-2019 21:46:53     java.lang.AssertionError at KafkaItemReaderTests.java:305
13-May-2019 21:46:58
13-May-2019 21:46:58 > Task :spring-batch-integration:check
13-May-2019 21:46:58 > Task :spring-batch-integration:build
13-May-2019 21:46:58 > Task :spring-batch-test:check
13-May-2019 21:46:58 > Task :spring-batch-test:build
13-May-2019 21:46:58 > Task :spring-batch-core-tests:jacocoTestReport SKIPPED
13-May-2019 21:47:05 > Task :spring-batch-integration:jacocoTestReport
13-May-2019 21:47:05 > Task :spring-batch-test:jacocoTestReport
13-May-2019 21:47:08
13-May-2019 21:47:08 > Task :spring-batch-core:test
13-May-2019 21:47:09
13-May-2019 21:47:09 1903 tests completed, 1 failed, 7 skipped
13-May-2019 21:47:20
13-May-2019 21:47:20 > Task :spring-batch-samples:test
13-May-2019 21:47:20 > Task :spring-batch-core:test FAILED
13-May-2019 21:47:27
13-May-2019 21:47:27 1528 tests completed, 1 failed, 1 skipped
13-May-2019 21:47:27
13-May-2019 21:47:27 > Task :spring-batch-infrastructure:test
13-May-2019 21:47:31
13-May-2019 21:47:31 > Task :spring-batch-infrastructure:test FAILED
13-May-2019 21:47:35 > Task :runTck
13-May-2019 21:49:24 > Task :artifactoryDeploy
13-May-2019 21:49:24 87 actionable tasks: 78 executed, 9 up-to-date
13-May-2019 21:49:24
13-May-2019 21:49:24 FAILURE: Build completed with 2 failures.
13-May-2019 21:49:24
13-May-2019 21:49:24 1: Task failed with an exception.
13-May-2019 21:49:24 -----------
13-May-2019 21:49:24 * What went wrong:
13-May-2019 21:49:24 Execution failed for task ':spring-batch-core:test'.
13-May-2019 21:49:24 > There were failing tests. See the report at: file:///C:/opt/bamboo-home/xml-data/build-dir/BATCH-BATCHWIN-JOB1/spring-batch-core/build/reports/tests/test/index.html
13-May-2019 21:49:24
13-May-2019 21:49:24 * Try:
13-May-2019 21:49:24 Run with --stacktrace option to get the stack trace. Run with --info or --debug option to get more log output. Run with --scan to get full insights.
13-May-2019 21:49:24 ==============================================================================
13-May-2019 21:49:24
13-May-2019 21:49:24 2: Task failed with an exception.
13-May-2019 21:49:24 -----------
13-May-2019 21:49:24 * What went wrong:
13-May-2019 21:49:24 Execution failed for task ':spring-batch-infrastructure:test'.
13-May-2019 21:49:24 > There were failing tests. See the report at: file:///C:/opt/bamboo-home/xml-data/build-dir/BATCH-BATCHWIN-JOB1/spring-batch-infrastructure/build/reports/tests/test/index.html
13-May-2019 21:49:24
13-May-2019 21:49:24 * Try:
13-May-2019 21:49:24 Run with --stacktrace option to get the stack trace. Run with --info or --debug option to get more log output. Run with --scan to get full insights.
13-May-2019 21:49:24 ==============================================================================
13-May-2019 21:49:24
13-May-2019 21:49:24 * Get more help at https://help.gradle.org
13-May-2019 21:49:24
13-May-2019 21:49:24 BUILD FAILED in 5m 6s
13-May-2019 21:49:25
13-May-2019 21:49:25 Failing task since return code of [./gradlew.bat -x javadoc -x asciidoc -x makePDF --parallel clean build jacocoTestReport runTck -I C:\Users\bamboo\AppData\Local\Temp\artifactory.init.script5608353907445099023gradle -DbuildInfoConfig.propertiesFile=C:\Users\bamboo\AppData\Local\Temp\buildinfo6759076966263130647properties artifactoryPublish -Dartifactory.resolve.password=******** -Dartifactory.publish.password=********] was 1 while expected 0
13-May-2019 21:49:25 Parsing test results under C:\opt\bamboo-home\xml-data\build-dir\BATCH-BATCHWIN-JOB1...
13-May-2019 21:49:26 Finished task 'Gradle build' with result: Failed
13-May-2019 21:49:26 Running post build plugin 'Docker Container Cleanup'
13-May-2019 21:49:26 Running post build plugin 'NCover Results Collector'
13-May-2019 21:49:26 Running post build plugin 'Artifactory Release Management Staging'
13-May-2019 21:49:26 Running post build plugin 'Artifactory Build Info Copier'
13-May-2019 21:49:26 Running post build plugin 'Artifactory Gradle Properties Info Copier'
13-May-2019 21:49:26 Running post build plugin 'Clover Results Collector'
13-May-2019 21:49:26 Running post build plugin 'npm Cache Cleanup'
13-May-2019 21:49:26 Running post build plugin 'Artifact Copier'
13-May-2019 21:49:26 Publishing an artifact: Test Results
13-May-2019 21:49:27 Finished publishing of artifact Job artifact: [Test Results], pattern: [*/build/reports/tests/**/*.*] in 407.4 ms
13-May-2019 21:49:27 Publishing an artifact: Coverage Report
13-May-2019 21:49:27 Finished publishing of artifact Job artifact: [Coverage Report], pattern: [*/build/reports/jacoco/test/html/**/*.*] in 132.0 ms
13-May-2019 21:49:29 Successfully removed working directory at 'C:\opt\bamboo-home\xml-data\build-dir\BATCH-BATCHWIN-JOB1'
13-May-2019 21:49:29 Finalising the build...
13-May-2019 21:49:29 Stopping timer.
13-May-2019 21:49:29 Build BATCH-BATCHWIN-JOB1-128 completed.
13-May-2019 21:49:29 Running on server: post build plugin 'NCover Results Collector'
13-May-2019 21:49:29 Running on server: post build plugin 'Build Hanging Detection Configuration'
13-May-2019 21:49:29 Running on server: post build plugin 'Clover Delta Calculator'
13-May-2019 21:49:29 Running on server: post build plugin 'Maven Dependencies Postprocessor'
13-May-2019 21:49:29 All post build plugins have finished
13-May-2019 21:49:29 Generating build results summary...
13-May-2019 21:49:32 Saving build results to disk...
13-May-2019 21:49:32 Logging substituted variables...
13-May-2019 21:49:32 Indexing build results...
13-May-2019 21:49:32 Finished building BATCH-BATCHWIN-JOB1-128.