Build #133

Build plan for MS Windows

Build: #133 failed

Job: Default Job failed

Stages & jobs

  1. Default Stage

Job result summary

Completed
Duration
4 minutes
Agent
bamboo-2k16-02
Revision
afc25dc87388799c23bc80e2550b0a8b16c29e23 afc25dc87388799c23bc80e2550b0a8b16c29e23
Total tests
3749
Failing since
#130 (Code changes detected – )

Tests

  • 3,749 tests in total
  • 1 test failed
  • 1 failure is new
  • 1 test was fixed
  • 10 tests were quarantined / skipped
  • 4 minutes taken in total.
New test failures 1
Status Test Duration
Collapse Failed KafkaItemReaderTests testReadFromSinglePartitionAfterRestart History
< 1 sec
java.lang.AssertionError: java.lang.AssertionError: 
Expected: iterable over ["val2", "val3", "val4"] in any order
     but: Not matched: "val0"
java.lang.AssertionError: 
Expected: iterable over ["val2", "val3", "val4"] in any order
     but: Not matched: "val0"
	at org.hamcrest.MatcherAssert.assertThat(MatcherAssert.java:20)
	at org.junit.Assert.assertThat(Assert.java:956)
(51 more lines...)
Fixed tests 1
Status Test Failing since Duration
Successful SplitInterruptedJobParserTests testSplitInterrupted History
Failing since build #131 (Code changes detected) < 1 sec

Error summary

The build generated some errors. See the full build log for more details.

import com.mongodb.util.JSON;
                       ^
C:\opt\bamboo-home\xml-data\build-dir\BATCH-BATCHWIN-JOB1\spring-batch-infrastructure\src\main\java\org\springframework\batch\item\database\HibernateItemReaderHelper.java:23: warning: [deprecation] Query in org.hibernate has been deprecated
import org.hibernate.Query;
                    ^
C:\opt\bamboo-home\xml-data\build-dir\BATCH-BATCHWIN-JOB1\spring-batch-infrastructure\src\main\java\org\springframework\batch\item\data\MongoItemReader.java:264: warning: [deprecation] JSON in com.mongodb.util has been deprecated
                return JSON.serialize(values.get(index));
                       ^
C:\opt\bamboo-home\xml-data\build-dir\BATCH-BATCHWIN-JOB1\spring-batch-infrastructure\src\main\java\org\springframework\batch\item\data\builder\RepositoryItemWriterBuilder.java:43: warning: [rawtypes] found raw type: RepositoryMethodReference
        private RepositoryMethodReference repositoryMethodReference;
                ^
  missing type arguments for generic class RepositoryMethodReference<T>
  where T is a type-variable:
    T extends Object declared in class RepositoryMethodReference
C:\opt\bamboo-home\xml-data\build-dir\BATCH-BATCHWIN-JOB1\spring-batch-infrastructure\src\main\java\org\springframework\batch\item\data\builder\RepositoryItemWriterBuilder.java:90: warning: [rawtypes] found raw type: RepositoryMethodReference
        public RepositoryItemWriterBuilder<T> repository(RepositoryItemWriterBuilder.RepositoryMethodReference repositoryMethodReference) {
                                                                                    ^
  missing type arguments for generic class RepositoryMethodReference<T>
  where T is a type-variable:
    T extends Object declared in class RepositoryMethodReference
C:\opt\bamboo-home\xml-data\build-dir\BATCH-BATCHWIN-JOB1\spring-batch-infrastructure\src\main\java\org\springframework\batch\item\data\builder\RepositoryItemWriterBuilder.java:104: warning: [unchecked] unchecked conversion
                        this.repository = this.repositoryMethodReference.getRepository();
                                                                                      ^
  required: CrudRepository<T,?>
  found:    CrudRepository
  where T is a type-variable:
    T extends Object declared in class RepositoryItemWriterBuilder
C:\opt\bamboo-home\xml-data\build-dir\BATCH-BATCHWIN-JOB1\spring-batch-infrastructure\src\main\java\org\springframework\batch\item\database\HibernateItemReaderHelper.java:123: warning: [deprecation] Query in org.hibernate has been deprecated
                Query query = createQuery();
                ^
C:\opt\bamboo-home\xml-data\build-dir\BATCH-BATCHWIN-JOB1\spring-batch-infrastructure\src\main\java\org\springframework\batch\item\database\HibernateItemReaderHelper.java:135: warning: [deprecation] Query in org.hibernate has been deprecated
        public Query createQuery() {
               ^
C:\opt\bamboo-home\xml-data\build-dir\BATCH-BATCHWIN-JOB1\spring-batch-infrastructure\src\main\java\org\springframework\batch\item\database\HibernateItemReaderHelper.java:222: warning: [deprecation] Query in org.hibernate has been deprecated
                Query query = createQuery();
                ^
C:\opt\bamboo-home\xml-data\build-dir\BATCH-BATCHWIN-JOB1\spring-batch-infrastructure\src\main\java\org\springframework\batch\item\kafka\KafkaItemReader.java:150: warning: [unchecked] unchecked cast
                        Map<TopicPartition, Long> offsets = (Map<TopicPartition, Long>) executionContext.get(TOPIC_PARTITION_OFFSETS);
                                                                                                            ^
  required: Map<TopicPartition,Long>
  found:    Object
10 warnings
C:\opt\bamboo-home\xml-data\build-dir\BATCH-BATCHWIN-JOB1\spring-batch-core\src\main\java\org\springframework\batch\core\configuration\support\AbstractApplicationContextFactory.java:34: warning: [deprecation] PropertyPlaceholderConfigurer in org.springframework.beans.factory.config has been deprecated
import org.springframework.beans.factory.config.PropertyPlaceholderConfigurer;
                                               ^
C:\opt\bamboo-home\xml-data\build-dir\BATCH-BATCHWIN-JOB1\spring-batch-core\src\main\java\org\springframework\batch\core\configuration\support\ClasspathXmlApplicationContextsFactoryBean.java:27: warning: [deprecation] PropertyPlaceholderConfigurer in org.springframework.beans.factory.config has been deprecated
import org.springframework.beans.factory.config.PropertyPlaceholderConfigurer;
                                               ^
C:\opt\bamboo-home\xml-data\build-dir\BATCH-BATCHWIN-JOB1\spring-batch-core\src\main\java\org\springframework\batch\core\step\builder\SimpleStepBuilder.java:232: warning: [overloads] processor(ItemProcessor<? super I,? extends O>) in SimpleStepBuilder is potentially ambiguous with processor(Function<? super I,? extends O>) in SimpleStepBuilder
        public SimpleStepBuilder<I, O> processor(ItemProcessor<? super I, ? extends O> processor) {
                                       ^
  where I,O are type-variables:
    I extends Object declared in class SimpleStepBuilder
    O extends Object declared in class SimpleStepBuilder
C:\opt\bamboo-home\xml-data\build-dir\BATCH-BATCHWIN-JOB1\spring-batch-core\src\main\java\org\springframework\batch\core\configuration\support\AbstractApplicationContextFactory.java:75: warning: [deprecation] PropertyPlaceholderConfigurer in org.springframework.beans.factory.config has been deprecated
                beanFactoryPostProcessorClasses.add(PropertyPlaceholderConfigurer.class);
                                                    ^
C:\opt\bamboo-home\xml-data\build-dir\BATCH-BATCHWIN-JOB1\spring-batch-core\src\main\java\org\springframework\batch\core\jsr\configuration\support\SpringAutowiredAnnotationBeanPostProcessor.java:264: warning: [deprecation] postProcessPropertyValues(PropertyValues,PropertyDescriptor[],Object,String) in InstantiationAwareBeanPostProcessorAdapter has been deprecated
    public PropertyValues postProcessPropertyValues(
                          ^
5 warnings
C:\Windows\System32\config\systemprofile\.gradle\caches\modules-2\files-2.1\org.springframework\spring-core\5.2.0.M3\63ff2e4cf81881c7a20b8e91e18c05f09a9e0eb7\spring-core-5.2.0.M3.jar(org/springframework/lang/Nullable.class): warning: Cannot find annotation method 'when()' in type 'Nonnull': class file for javax.annotation.Nonnull not found
warning: unknown enum constant When.MAYBE
  reason: class file for javax.annotation.meta.When not found
C:\Windows\System32\config\systemprofile\.gradle\caches\modules-2\files-2.1\org.springframework\spring-core\5.2.0.M3\63ff2e4cf81881c7a20b8e91e18c05f09a9e0eb7\spring-core-5.2.0.M3.jar(org/springframework/lang/NonNullApi.class): warning: Cannot find annotation method 'value()' in type 'TypeQualifierDefault': class file for javax.annotation.meta.TypeQualifierDefault not found
3 warnings
C:\opt\bamboo-home\xml-data\build-dir\BATCH-BATCHWIN-JOB1\spring-batch-core\src\main\java\org\springframework\batch\core\metrics\BatchMetrics.java:76: warning - Tag @link: reference not found: Timer.Sample
C:\opt\bamboo-home\xml-data\build-dir\BATCH-BATCHWIN-JOB1\spring-batch-core\src\main\java\org\springframework\batch\core\metrics\BatchMetrics.java:76: warning - Tag @link: reference not found: Timer.Sample
C:\opt\bamboo-home\xml-data\build-dir\BATCH-BATCHWIN-JOB1\spring-batch-core\src\main\java\org\springframework\batch\core\metrics\BatchMetrics.java:76: warning - Tag @link: reference not found: Timer.Sample

1529 tests completed, 1 failed, 1 skipped

FAILURE: Build completed with 2 failures.

1: Task failed with an exception.
-----------
* Where:
Build file 'C:\opt\bamboo-home\xml-data\build-dir\BATCH-BATCHWIN-JOB1\build.gradle' line: 937

* What went wrong:
Execution failed for task ':runTck'.
> Basedir C:\opt\jsr352-tck-1.0 does not exist

* Try:
Run with --stacktrace option to get the stack trace. Run with --info or --debug option to get more log output. Run with --scan to get full insights.
==============================================================================

2: Task failed with an exception.
-----------
* What went wrong:
Execution failed for task ':spring-batch-infrastructure:test'.
> There were failing tests. See the report at: file:///C:/opt/bamboo-home/xml-data/build-dir/BATCH-BATCHWIN-JOB1/spring-batch-infrastructure/build/reports/tests/test/index.html

* Try:
Run with --stacktrace option to get the stack trace. Run with --info or --debug option to get more log output. Run with --scan to get full insights.
==============================================================================

* Get more help at https://help.gradle.org

BUILD FAILED in 4m 11s