Build #141

Build plan for MS Windows

Build: #141 failed

Job: Default Job failed

Stages & jobs

  1. Default Stage

Build log

The build generated 397 lines of output. Download or view full build log

04-Sep-2019 11:47:56 Build Spring Batch - Windows - Default Job #141 (BATCH-BATCHWIN-JOB1-141) started building on agent bamboo-2k16-02
04-Sep-2019 11:47:56 Remote agent on host bamboo-2k16-02.af.pivotal.io
04-Sep-2019 11:47:56 Build working directory is C:\opt\bamboo-home\xml-data\build-dir\BATCH-BATCHWIN-JOB1
04-Sep-2019 11:47:56 Executing build Spring Batch - Windows - Default Job #141 (BATCH-BATCHWIN-JOB1-141)
04-Sep-2019 11:47:56 Starting task 'Checkout Default Repository' of type 'com.atlassian.bamboo.plugins.vcs:task.vcs.checkout'
04-Sep-2019 11:47:56 Build always requires a clean checkout
04-Sep-2019 11:47:56 Cleaning build directory 'C:\opt\bamboo-home\xml-data\build-dir\BATCH-BATCHWIN-JOB1'
04-Sep-2019 11:47:56 Checking out into C:\opt\bamboo-home\xml-data\build-dir\BATCH-BATCHWIN-JOB1
04-Sep-2019 11:47:56 Updating source code to revision: a15a6bfad805d72d94ae999ae0b7cd14e94f87a2
04-Sep-2019 11:47:56 Creating local git repository in 'C:\opt\bamboo-home\xml-data\build-dir\BATCH-BATCHWIN-JOB1\.git'.
04-Sep-2019 11:47:56 Initialized empty Git repository in C:/opt/bamboo-home/xml-data/build-dir/BATCH-BATCHWIN-JOB1/.git/
04-Sep-2019 11:47:57 Fetching 'refs/heads/master' from 'https://github.com/benas/spring-batch.git'.
04-Sep-2019 11:48:11 From https://github.com/benas/spring-batch
04-Sep-2019 11:48:11 * [new branch]      master     -> master
04-Sep-2019 11:48:11 * [new tag]             2.2.0.M1      -> 2.2.0.M1
04-Sep-2019 11:48:11 * [new tag]             2.2.0.RC1     -> 2.2.0.RC1
04-Sep-2019 11:48:11 * [new tag]             2.2.0.RC2     -> 2.2.0.RC2
04-Sep-2019 11:48:11 * [new tag]             2.2.0.RELEASE -> 2.2.0.RELEASE
04-Sep-2019 11:48:11 * [new tag]             2.2.1.RELEASE -> 2.2.1.RELEASE
04-Sep-2019 11:48:11 * [new tag]             3.0.0.M1      -> 3.0.0.M1
04-Sep-2019 11:48:11 * [new tag]             3.0.0.M2      -> 3.0.0.M2
04-Sep-2019 11:48:11 * [new tag]             3.0.0.M3      -> 3.0.0.M3
04-Sep-2019 11:48:11 Checking out revision a15a6bfad805d72d94ae999ae0b7cd14e94f87a2.
04-Sep-2019 11:48:12 Already on 'master'
04-Sep-2019 11:48:12 Updated source code to revision: a15a6bfad805d72d94ae999ae0b7cd14e94f87a2
04-Sep-2019 11:48:12 Finished task 'Checkout Default Repository' with result: Success
04-Sep-2019 11:48:12 Running pre-build action: Artifactory Release Staging
04-Sep-2019 11:48:12 Running pre-build action: VCS Version Collector
04-Sep-2019 11:48:13 Starting task 'Gradle build' of type 'org.jfrog.bamboo.bamboo-artifactory-plugin:artifactoryGradleTask'
04-Sep-2019 11:48:13 Bamboo Artifactory Plugin version: 2.6.3
04-Sep-2019 11:48:13
Beginning to execute external process for build 'Spring Batch - Windows - Default Job #141 (BATCH-BATCHWIN-JOB1-141)'
... running command line:
./gradlew.bat -x javadoc -x asciidoc -x makePDF --parallel clean build jacocoTestReport -I C:\Windows\System32\config\systemprofile\AppData\Local\Temp\artifactory.init.script2014427264935215145gradle -DbuildInfoConfig.propertiesFile=C:\Windows\System32\config\systemprofile\AppData\Local\Temp\buildinfo1011728021352130519properties artifactoryPublish -Dartifactory.resolve.password=******** -Dartifactory.publish.password=********
... in: C:\opt\bamboo-home\xml-data\build-dir\BATCH-BATCHWIN-JOB1
... using extra environment variables:
bamboo_planRepository_1_branch=master
bamboo_********_username_password=********
bamboo_signing_store_password=********
bamboo_capability_system_builder_ant_Ant_1_9=C:\opt\apache-ant-1.9.14
bamboo_capability_system_builder_ant_Ant_1_8=C:\opt\apache-ant-1.8.4
bamboo_planRepository_1_branchDisplayName=master
bamboo_artifactory_override_resolve_repo=libs-milestone
bamboo_repository_revision_number=a15a6bfad805d72d94ae999ae0b7cd14e94f87a2
bamboo_capability_system_builder_msbuild_MSBuild_v4_0__32bit_=C:\Windows\Microsoft.NET\Framework\v4.0.30319\MSBuild.exe
ALLUSERSPROFILE=C:\ProgramData
bamboo_RIAK_BIN=/usr/sbin/riak
bamboo_repository_268501009_git_repositoryUrl=https://github.com/benas/spring-batch.git
WRAPPER_BITS=64
bamboo_buildKey=BATCH-BATCHWIN-JOB1
SystemDrive=C:
bamboo_bintray_password=********
USERNAME=SYSTEM
bamboo_repository_268501009_revision_number=a15a6bfad805d72d94ae999ae0b7cd14e94f87a2
bamboo_sonar_token_password=********
ProgramFiles(x86)=C:\Program Files (x86)
bamboo_shortJobName=Default Job
bamboo_artifactory_override_resolver_password=********
bamboo_sonatype_token=RSJChaox
bamboo_capability_system_builder_gradle___gradlew=./gradlew
bamboo_buildResultsUrl=https://build.spring.io/browse/BATCH-BATCHWIN-JOB1-141
bamboo_capability_system_builder_mvn3_Maven_3_3=C:\opt\apache-maven-3.3.9
bamboo_capability_system_builder_mvn3_Maven_3_2=C:\opt\apache-maven-3.2.5
bamboo_capability_system_builder_mvn3_Maven_3_1=C:\opt\apache-maven-3.1.1
bamboo_planRepository_repositoryUrl=https://github.com/benas/spring-batch.git
PATHEXT=.COM;.EXE;.BAT;.CMD;.VBS;.VBE;.JS;.JSE;.WSF;.WSH;.MSC
bamboo_agentId=286195724
bamboo_capability_system_builder_mvn3_Maven_3_5=C:\opt\apache-maven-3.5.4
bamboo_capability_system_builder_mvn3_Maven_3_0=C:\opt\apache-maven-3.0.5
bamboo_planRepository_revision=a15a6bfad805d72d94ae999ae0b7cd14e94f87a2
bamboo_planRepository_previousRevision=5be1c9af94ee8a76d53ba96dbdf27b32a1ecd1ed
PROCESSOR_IDENTIFIER=Intel64 Family 6 Model 85 Stepping 4, GenuineIntel
bamboo_capability_remote_build=true
bamboo_repository_branch_name=master
ProgramFiles=C:\Program Files
PUBLIC=C:\Users\Public
windir=C:\Windows
bamboo_sonatype_token_password=********
bamboo_sonatype_user=springsource
bamboo_scdf_acceptance_tests_password=********
WRAPPER_OS=windows
JAVA_HOME=C:\opt\jdk-8\
bamboo_repository_268501009_previous_revision_number=5be1c9af94ee8a76d53ba96dbdf27b32a1ecd1ed
bamboo_planRepository_branch=master
=C:=C:\opt\bamboo-home\bin
APPDATA=C:\Windows\system32\config\systemprofile\AppData\Roaming
bamboo_planRepository_1_type=gitv2
bamboo_planRepository_branchName=master
bamboo_capability_system_jdk_JDK_12=C:\opt\jdk-12
WRAPPER_FILE_SEPARATOR=\
bamboo_capability_system_builder_gradlew_gradlew=./
bamboo_capability_system_builder_ant_Ant_1_10=C:\opt\apache-ant-1.10.6
COMPUTERNAME=WIN-OUDKQ7UFSBD
WRAPPER_PATH_SEPARATOR=;
bamboo_sonar_password=********
bamboo_hg_cache_directory=C:\opt\bamboo-home\xml-data\build-dir\_hg-repositories-cache
bamboo_planRepository_1_username=spring-buildmaster
bamboo_planRepository_type=gitv2
bamboo_repository_268501009_name=Git
bamboo_git_cache_directory=C:\opt\bamboo-home\xml-data\build-dir\_git-repositories-cache
ComSpec=C:\Windows\system32\cmd.exe
bamboo_artifactory_username=buildmaster
bamboo_tmp_directory=C:\opt\bamboo-home\temp
bamboo_planKey=BATCH-BATCHWIN
bamboo_planRepository_username=spring-buildmaster
bamboo_JDK8_HOME=/opt/jdk-8
NUMBER_OF_PROCESSORS=4
bamboo_planRepository_1_branchName=master
bamboo_sonar_version=5.6.3
bamboo_sonar_jdbc_password=********
bamboo_bintray_api_key_password=********
PROCESSOR_LEVEL=6
bamboo_capability_system_jdk_JDK_1_11=C:\opt\jdk-11
bamboo_resultsUrl=https://build.spring.io/browse/BATCH-BATCHWIN-JOB1-141
bamboo_capability_system_jdk_JDK_1_10=C:\opt\jdk-10
PROCESSOR_ARCHITECTURE=AMD64
bamboo_build_working_directory=C:\opt\bamboo-home\xml-data\build-dir\BATCH-BATCHWIN-JOB1
bamboo_planRepository_1_name=Git
PSModulePath=C:\Program Files\WindowsPowerShell\Modules;C:\Windows\system32\WindowsPowerShell\v1.0\Modules
bamboo_capability_system_os=windows2016
bamboo_nexusPush_stagingProfile=buildmaster
bamboo_shortPlanName=Windows
bamboo_planRepository_name=Git
bamboo_repository_268501009_branch_name=master
bamboo_buildNumber=141
bamboo_planName=Spring Batch - Windows
bamboo_JDK7_HOME=/opt/jdk-7
bamboo_shortPlanKey=BATCHWIN
bamboo_shortJobKey=JOB1
bamboo_artifactory_password=********
bamboo_repository_268501009_git_branch=master
ProgramData=C:\ProgramData
ProgramW6432=C:\Program Files
bamboo_buildTimeStamp=2019-09-04T10:53:59.527Z
bamboo_repository_previous_revision_number=5be1c9af94ee8a76d53ba96dbdf27b32a1ecd1ed
bamboo_sonar_username=buildmaster
bamboo_********_password=********
bamboo_repository_git_branch=master
bamboo_buildResultKey=BATCH-BATCHWIN-JOB1-141
bamboo_nexusPush_close=true
bamboo_artifactory_override_resolver_username=buildmaster
bamboo_buildPlanName=Spring Batch - Windows - Default Job
bamboo_planRepository_1_revision=a15a6bfad805d72d94ae999ae0b7cd14e94f87a2
LOCALAPPDATA=C:\Windows\system32\config\systemprofile\AppData\Local
bamboo_repository_name=Git
bamboo_signing_key_password=********
USERDOMAIN=WORKGROUP
bamboo_JSR_352_TCK_HOME="C:\opt\jsr352-tck-1.0"
JSR_352_TCK_HOME=C:\opt\jsr352-tck-1.0
bamboo_buildFailed=false
bamboo_capability_system_docker_executable=/usr/bin/docker
bamboo_artifactory_override_deployer_username=buildmaster
bamboo_artifactory_password_mask_b=********
bamboo_artifactory_password_mask_a=********
bamboo_agentWorkingDirectory=C:\opt\bamboo-home\xml-data\build-dir
bamboo_capability_system_git_executable=C:\Program Files\Git\bin\git.exe
bamboo_repository_git_username=spring-buildmaster
bamboo_planRepository_1_previousRevision=5be1c9af94ee8a76d53ba96dbdf27b32a1ecd1ed
bamboo_capability_os_family=windows
bamboo_planRepository_branchDisplayName=master
CommonProgramFiles=C:\Program Files\Common Files
bamboo_capability_system_builder_maven_Artifactory_Maven_3_5=C:\opt\apache-maven-3.5.4
bamboo_capability_system_builder_maven_Artifactory_Maven_3_3=C:\opt\apache-maven-3.3.9
bamboo_capability_system_builder_maven_Artifactory_Maven_3_2=C:\opt\apache-maven-3.2.5
bamboo_s3_properties=/home/bamboo/tools/s3.properties
OS=Windows_NT
bamboo_capability_system_builder_maven_Artifactory_Maven_3_1=C:\opt\apache-maven-3.1.1
bamboo_artifactory_override_deploy_repo=libs-snapshot-local
bamboo_capability_system_builder_maven_Artifactory_Maven_3_0=C:\opt\apache-maven-3.0.5
bamboo_plan_storageTag=plan-268238890
bamboo_bintray_username_password=********
PROCESSOR_REVISION=5504
bamboo_repository_git_repositoryUrl=https://github.com/benas/spring-batch.git
CommonProgramW6432=C:\Program Files\Common Files
bamboo_capability_system_builder_msbuild_MSBuild_v4_0__64bit_=C:\Windows\Microsoft.NET\Framework64\v4.0.30319\MSBuild.exe
bamboo_repository_268501009_git_username=spring-buildmaster
bamboo_working_directory=C:\opt\bamboo-home\xml-data\build-dir\BATCH-BATCHWIN-JOB1
SystemRoot=C:\Windows
TEMP=C:\Windows\system32\config\systemprofile\AppData\Local\Temp
USERPROFILE=C:\Windows\system32\config\systemprofile
bamboo_planRepository_1_repositoryUrl=https://github.com/benas/spring-batch.git
TMP=C:\Windows\system32\config\systemprofile\AppData\Local\Temp
bamboo_capability_system_jdk_JDK_1_8=C:\opt\jdk-8
bamboo_artifactory_override_deployer_password=********
bamboo_capability_system_jdk_JDK_1_9=C:\opt\jdk-9
CommonProgramFiles(x86)=C:\Program Files (x86)\Common Files
WRAPPER_ARCH=x86
bamboo_sonatype_password=********
bamboo_sonar_ip=10.194.6.9
Path=C:\Windows\system32\config\systemprofile\AppData\Local\Microsoft\WindowsApps;;C:\Windows\system32\config\systemprofile\AppData\Local\Microsoft\WindowsApps;
04-Sep-2019 11:48:13 Downloading https://services.gradle.org/distributions/gradle-4.10.3-all.zip
04-Sep-2019 11:48:16 ................................................................................................................
04-Sep-2019 11:49:52
04-Sep-2019 11:49:52 Welcome to Gradle 4.10.3!
04-Sep-2019 11:49:52
04-Sep-2019 11:49:52 Here are the highlights of this release:
04-Sep-2019 11:49:52 - Incremental Java compilation by default
04-Sep-2019 11:49:52 - Periodic Gradle caches cleanup
04-Sep-2019 11:49:52 - Gradle Kotlin DSL 1.0-RC6
04-Sep-2019 11:49:52 - Nested included builds
04-Sep-2019 11:49:52 - SNAPSHOT plugin versions in the `plugins {}` block
04-Sep-2019 11:49:52
04-Sep-2019 11:49:52 For more details see https://docs.gradle.org/4.10.3/release-notes.html
04-Sep-2019 11:49:52
04-Sep-2019 11:49:52 Starting a Gradle Daemon, 1 stopped Daemon could not be reused, use --status for details
04-Sep-2019 11:49:55 Parallel execution is an incubating feature.
04-Sep-2019 11:50:01 > Task :buildSrc:compileJava NO-SOURCE
04-Sep-2019 11:50:04 > Task :buildSrc:compileGroovy
04-Sep-2019 11:50:04 > Task :buildSrc:processResources
04-Sep-2019 11:50:04 > Task :buildSrc:classes
04-Sep-2019 11:50:04 > Task :buildSrc:jar
04-Sep-2019 11:50:04 > Task :buildSrc:assemble
04-Sep-2019 11:50:04 > Task :buildSrc:compileTestJava NO-SOURCE
04-Sep-2019 11:50:04 > Task :buildSrc:compileTestGroovy NO-SOURCE
04-Sep-2019 11:50:04 > Task :buildSrc:processTestResources NO-SOURCE
04-Sep-2019 11:50:04 > Task :buildSrc:testClasses UP-TO-DATE
04-Sep-2019 11:50:04 > Task :buildSrc:test NO-SOURCE
04-Sep-2019 11:50:04 > Task :buildSrc:check UP-TO-DATE
04-Sep-2019 11:50:04 > Task :buildSrc:build
04-Sep-2019 11:50:17 Cannot publish pom for project ':spring-build-src' since it does not contain the Maven plugin install task and task ':spring-build-src:artifactoryPublish' does not specify a custom pom path.
04-Sep-2019 11:50:17 Cannot publish pom for project ':' since it does not contain the Maven plugin install task and task ':artifactoryPublish' does not specify a custom pom path.
04-Sep-2019 11:50:18 > Task :spring-batch-docs:clean UP-TO-DATE
04-Sep-2019 11:50:18 > Task :clean UP-TO-DATE
04-Sep-2019 11:50:18 > Task :spring-batch-infrastructure:clean UP-TO-DATE
04-Sep-2019 11:50:18 > Task :spring-batch-infrastructure-tests:clean UP-TO-DATE
04-Sep-2019 11:50:18 > Task :spring-batch-core:clean UP-TO-DATE
04-Sep-2019 11:50:18 > Task :spring-batch-integration:clean UP-TO-DATE
04-Sep-2019 11:50:18 > Task :spring-batch-samples:clean UP-TO-DATE
04-Sep-2019 11:50:18 > Task :spring-batch-core-tests:clean UP-TO-DATE
04-Sep-2019 11:50:18 > Task :spring-batch-test:clean UP-TO-DATE
04-Sep-2019 11:50:18 > Task :spring-build-src:clean
04-Sep-2019 11:50:18 > Task :spring-batch-integration:processResources
04-Sep-2019 11:50:18 > Task :spring-batch-integration:javadocJar
04-Sep-2019 11:50:18 > Task :schemaZip
04-Sep-2019 11:50:18 > Task :spring-batch-test:processResources
04-Sep-2019 11:50:18 > Task :spring-batch-test:javadocJar
04-Sep-2019 11:50:18 > Task :spring-batch-test:sourcesJar
04-Sep-2019 11:50:18 > Task :check UP-TO-DATE
04-Sep-2019 11:50:18 > Task :spring-batch-core:processResources
04-Sep-2019 11:50:18 > Task :spring-batch-core:javadocJar
04-Sep-2019 11:50:18 > Task :spring-batch-integration:sourcesJar
04-Sep-2019 11:50:18 > Task :spring-batch-docs:compileJava NO-SOURCE
04-Sep-2019 11:50:18 > Task :spring-batch-docs:processResources NO-SOURCE
04-Sep-2019 11:50:18 > Task :spring-batch-docs:classes UP-TO-DATE
04-Sep-2019 11:50:18 > Task :spring-batch-core-tests:processResources
04-Sep-2019 11:50:18 > Task :spring-batch-core-tests:javadocJar
04-Sep-2019 11:50:18 > Task :spring-batch-docs:jar
04-Sep-2019 11:50:18 > Task :spring-batch-docs:javadocJar
04-Sep-2019 11:50:18 > Task :spring-batch-docs:sourcesJar
04-Sep-2019 11:50:18 > Task :spring-batch-docs:assemble
04-Sep-2019 11:50:18 > Task :spring-batch-docs:checkTestConfigs
04-Sep-2019 11:50:18 > Task :spring-batch-docs:compileTestJava NO-SOURCE
04-Sep-2019 11:50:18 > Task :spring-batch-docs:processTestResources NO-SOURCE
04-Sep-2019 11:50:18 > Task :spring-batch-docs:testClasses UP-TO-DATE
04-Sep-2019 11:50:18 > Task :spring-batch-docs:test NO-SOURCE
04-Sep-2019 11:50:18 > Task :spring-batch-docs:check UP-TO-DATE
04-Sep-2019 11:50:18 > Task :spring-batch-docs:build
04-Sep-2019 11:50:18 > Task :spring-batch-infrastructure-tests:processResources NO-SOURCE
04-Sep-2019 11:50:18 > Task :spring-batch-infrastructure-tests:javadocJar
04-Sep-2019 11:50:19 > Task :spring-batch-core-tests:sourcesJar
04-Sep-2019 11:50:19 > Task :spring-batch-core-tests:checkTestConfigs
04-Sep-2019 11:50:19 > Task :spring-batch-core-tests:processTestResources
04-Sep-2019 11:50:21 > Task :spring-batch-infrastructure-tests:sourcesJar
04-Sep-2019 11:50:21 > Task :spring-batch-infrastructure-tests:checkTestConfigs
04-Sep-2019 11:50:22 > Task :spring-batch-core:sourcesJar
04-Sep-2019 11:50:22 > Task :spring-batch-core:checkTestConfigs
04-Sep-2019 11:50:22 > Task :spring-batch-infrastructure-tests:processTestResources
04-Sep-2019 11:50:22 > Task :spring-batch-integration:checkTestConfigs
04-Sep-2019 11:50:22 > Task :spring-batch-integration:processTestResources
04-Sep-2019 11:50:22 > Task :spring-batch-test:checkTestConfigs
04-Sep-2019 11:50:22 > Task :spring-batch-test:processTestResources
04-Sep-2019 11:50:22 > Task :spring-build-src:assemble UP-TO-DATE
04-Sep-2019 11:50:22 > Task :spring-build-src:compileJava NO-SOURCE
04-Sep-2019 11:50:23 > Task :spring-batch-samples:processResources
04-Sep-2019 11:50:23 > Task :spring-batch-samples:javadocJar
04-Sep-2019 11:50:23 > Task :spring-build-src:compileGroovy
04-Sep-2019 11:50:23 > Task :spring-build-src:processResources
04-Sep-2019 11:50:23 > Task :spring-build-src:classes
04-Sep-2019 11:50:23 > Task :spring-build-src:compileTestJava NO-SOURCE
04-Sep-2019 11:50:23 > Task :spring-build-src:compileTestGroovy NO-SOURCE
04-Sep-2019 11:50:23 > Task :spring-build-src:processTestResources NO-SOURCE
04-Sep-2019 11:50:23 > Task :spring-build-src:testClasses UP-TO-DATE
04-Sep-2019 11:50:23 > Task :spring-build-src:test NO-SOURCE
04-Sep-2019 11:50:23 > Task :spring-build-src:check UP-TO-DATE
04-Sep-2019 11:50:23 > Task :spring-build-src:build UP-TO-DATE
04-Sep-2019 11:50:23 > Task :spring-batch-docs:jacocoTestReport SKIPPED
04-Sep-2019 11:50:24 > Task :spring-batch-docs:install
04-Sep-2019 11:50:24 > Task :spring-batch-docs:artifactoryPublish
04-Sep-2019 11:50:24 > Task :spring-build-src:artifactoryPublish
04-Sep-2019 11:50:24 > Task :spring-batch-core:processTestResources
04-Sep-2019 11:50:24 > Task :spring-batch-samples:sourcesJar
04-Sep-2019 11:50:24 > Task :spring-batch-samples:checkTestConfigs
04-Sep-2019 11:50:24 > Task :spring-batch-samples:processTestResources
04-Sep-2019 11:50:48 > Task :spring-batch-infrastructure:compileJava
04-Sep-2019 11:51:01 C:\opt\bamboo-home\xml-data\build-dir\BATCH-BATCHWIN-JOB1\spring-batch-infrastructure\src\main\java\org\springframework\batch\item\data\MongoItemReader.java:26: warning: [deprecation] JSON in com.mongodb.util has been deprecated
04-Sep-2019 11:51:01 import com.mongodb.util.JSON;
04-Sep-2019 11:51:01                        ^
04-Sep-2019 11:51:01 C:\opt\bamboo-home\xml-data\build-dir\BATCH-BATCHWIN-JOB1\spring-batch-infrastructure\src\main\java\org\springframework\batch\item\database\HibernateItemReaderHelper.java:23: warning: [deprecation] Query in org.hibernate has been deprecated
04-Sep-2019 11:51:01 import org.hibernate.Query;
04-Sep-2019 11:51:01                     ^
04-Sep-2019 11:51:02 C:\opt\bamboo-home\xml-data\build-dir\BATCH-BATCHWIN-JOB1\spring-batch-infrastructure\src\main\java\org\springframework\batch\item\data\MongoItemReader.java:264: warning: [deprecation] JSON in com.mongodb.util has been deprecated
04-Sep-2019 11:51:02                 return JSON.serialize(values.get(index));
04-Sep-2019 11:51:02                        ^
04-Sep-2019 11:51:02 C:\opt\bamboo-home\xml-data\build-dir\BATCH-BATCHWIN-JOB1\spring-batch-infrastructure\src\main\java\org\springframework\batch\item\data\builder\RepositoryItemWriterBuilder.java:43: warning: [rawtypes] found raw type: RepositoryMethodReference
04-Sep-2019 11:51:02         private RepositoryMethodReference repositoryMethodReference;
04-Sep-2019 11:51:02                 ^
04-Sep-2019 11:51:02   missing type arguments for generic class RepositoryMethodReference<T>
04-Sep-2019 11:51:02   where T is a type-variable:
04-Sep-2019 11:51:02     T extends Object declared in class RepositoryMethodReference
04-Sep-2019 11:51:02 C:\opt\bamboo-home\xml-data\build-dir\BATCH-BATCHWIN-JOB1\spring-batch-infrastructure\src\main\java\org\springframework\batch\item\data\builder\RepositoryItemWriterBuilder.java:90: warning: [rawtypes] found raw type: RepositoryMethodReference
04-Sep-2019 11:51:02         public RepositoryItemWriterBuilder<T> repository(RepositoryItemWriterBuilder.RepositoryMethodReference repositoryMethodReference) {
04-Sep-2019 11:51:02                                                                                     ^
04-Sep-2019 11:51:02   missing type arguments for generic class RepositoryMethodReference<T>
04-Sep-2019 11:51:02   where T is a type-variable:
04-Sep-2019 11:51:02     T extends Object declared in class RepositoryMethodReference
04-Sep-2019 11:51:02 C:\opt\bamboo-home\xml-data\build-dir\BATCH-BATCHWIN-JOB1\spring-batch-infrastructure\src\main\java\org\springframework\batch\item\data\builder\RepositoryItemWriterBuilder.java:104: warning: [unchecked] unchecked conversion
04-Sep-2019 11:51:02                         this.repository = this.repositoryMethodReference.getRepository();
04-Sep-2019 11:51:02                                                                                       ^
04-Sep-2019 11:51:02   required: CrudRepository<T,?>
04-Sep-2019 11:51:02   found:    CrudRepository
04-Sep-2019 11:51:02   where T is a type-variable:
04-Sep-2019 11:51:02     T extends Object declared in class RepositoryItemWriterBuilder
04-Sep-2019 11:51:02 C:\opt\bamboo-home\xml-data\build-dir\BATCH-BATCHWIN-JOB1\spring-batch-infrastructure\src\main\java\org\springframework\batch\item\database\HibernateItemReaderHelper.java:123: warning: [deprecation] Query in org.hibernate has been deprecated
04-Sep-2019 11:51:02                 Query query = createQuery();
04-Sep-2019 11:51:02                 ^
04-Sep-2019 11:51:02 C:\opt\bamboo-home\xml-data\build-dir\BATCH-BATCHWIN-JOB1\spring-batch-infrastructure\src\main\java\org\springframework\batch\item\database\HibernateItemReaderHelper.java:135: warning: [deprecation] Query in org.hibernate has been deprecated
04-Sep-2019 11:51:02         public Query createQuery() {
04-Sep-2019 11:51:02                ^
04-Sep-2019 11:51:02 C:\opt\bamboo-home\xml-data\build-dir\BATCH-BATCHWIN-JOB1\spring-batch-infrastructure\src\main\java\org\springframework\batch\item\database\HibernateItemReaderHelper.java:222: warning: [deprecation] Query in org.hibernate has been deprecated
04-Sep-2019 11:51:02                 Query query = createQuery();
04-Sep-2019 11:51:02                 ^
04-Sep-2019 11:51:03 C:\opt\bamboo-home\xml-data\build-dir\BATCH-BATCHWIN-JOB1\spring-batch-infrastructure\src\main\java\org\springframework\batch\item\kafka\KafkaItemReader.java:150: warning: [unchecked] unchecked cast
04-Sep-2019 11:51:03                         Map<TopicPartition, Long> offsets = (Map<TopicPartition, Long>) executionContext.get(TOPIC_PARTITION_OFFSETS);
04-Sep-2019 11:51:03                                                                                                             ^
04-Sep-2019 11:51:03   required: Map<TopicPartition,Long>
04-Sep-2019 11:51:03   found:    Object
04-Sep-2019 11:51:04 10 warnings
04-Sep-2019 11:51:11
04-Sep-2019 11:51:11 > Task :spring-batch-infrastructure:processResources NO-SOURCE
04-Sep-2019 11:51:11 > Task :spring-batch-infrastructure:classes
04-Sep-2019 11:51:11 > Task :spring-batch-infrastructure:jar
04-Sep-2019 11:51:11 > Task :spring-batch-infrastructure:javadocJar
04-Sep-2019 11:51:11 > Task :spring-batch-infrastructure:sourcesJar
04-Sep-2019 11:51:11 > Task :spring-batch-infrastructure:assemble
04-Sep-2019 11:51:11 > Task :spring-batch-infrastructure:checkTestConfigs
04-Sep-2019 11:51:13 > Task :spring-batch-infrastructure-tests:compileJava
04-Sep-2019 11:51:13 > Task :spring-batch-infrastructure-tests:classes
04-Sep-2019 11:51:14 > Task :spring-batch-infrastructure-tests:jar
04-Sep-2019 11:51:14 > Task :spring-batch-infrastructure-tests:assemble
04-Sep-2019 11:51:15
04-Sep-2019 11:51:15 > Task :spring-batch-core:compileJava
04-Sep-2019 11:51:15 C:\opt\bamboo-home\xml-data\build-dir\BATCH-BATCHWIN-JOB1\spring-batch-core\src\main\java\org\springframework\batch\core\configuration\support\AbstractApplicationContextFactory.java:34: warning: [deprecation] PropertyPlaceholderConfigurer in org.springframework.beans.factory.config has been deprecated
04-Sep-2019 11:51:15 import org.springframework.beans.factory.config.PropertyPlaceholderConfigurer;
04-Sep-2019 11:51:15                                                ^
04-Sep-2019 11:51:15 C:\opt\bamboo-home\xml-data\build-dir\BATCH-BATCHWIN-JOB1\spring-batch-core\src\main\java\org\springframework\batch\core\configuration\support\ClasspathXmlApplicationContextsFactoryBean.java:27: warning: [deprecation] PropertyPlaceholderConfigurer in org.springframework.beans.factory.config has been deprecated
04-Sep-2019 11:51:15 import org.springframework.beans.factory.config.PropertyPlaceholderConfigurer;
04-Sep-2019 11:51:15                                                ^
04-Sep-2019 11:51:16 C:\opt\bamboo-home\xml-data\build-dir\BATCH-BATCHWIN-JOB1\spring-batch-core\src\main\java\org\springframework\batch\core\step\builder\SimpleStepBuilder.java:232: warning: [overloads] processor(ItemProcessor<? super I,? extends O>) in SimpleStepBuilder is potentially ambiguous with processor(Function<? super I,? extends O>) in SimpleStepBuilder
04-Sep-2019 11:51:16         public SimpleStepBuilder<I, O> processor(ItemProcessor<? super I, ? extends O> processor) {
04-Sep-2019 11:51:16                                        ^
04-Sep-2019 11:51:16   where I,O are type-variables:
04-Sep-2019 11:51:16     I extends Object declared in class SimpleStepBuilder
04-Sep-2019 11:51:16     O extends Object declared in class SimpleStepBuilder
04-Sep-2019 11:51:17 C:\opt\bamboo-home\xml-data\build-dir\BATCH-BATCHWIN-JOB1\spring-batch-core\src\main\java\org\springframework\batch\core\configuration\support\AbstractApplicationContextFactory.java:75: warning: [deprecation] PropertyPlaceholderConfigurer in org.springframework.beans.factory.config has been deprecated
04-Sep-2019 11:51:17                 beanFactoryPostProcessorClasses.add(PropertyPlaceholderConfigurer.class);
04-Sep-2019 11:51:17                                                     ^
04-Sep-2019 11:51:17 C:\opt\bamboo-home\xml-data\build-dir\BATCH-BATCHWIN-JOB1\spring-batch-core\src\main\java\org\springframework\batch\core\jsr\configuration\support\SpringAutowiredAnnotationBeanPostProcessor.java:264: warning: [deprecation] postProcessPropertyValues(PropertyValues,PropertyDescriptor[],Object,String) in InstantiationAwareBeanPostProcessorAdapter has been deprecated
04-Sep-2019 11:51:17     public PropertyValues postProcessPropertyValues(
04-Sep-2019 11:51:17                           ^
04-Sep-2019 11:51:19 5 warnings
04-Sep-2019 11:51:20
04-Sep-2019 11:51:20 > Task :spring-batch-core:classes
04-Sep-2019 11:51:20 > Task :spring-batch-core:jar
04-Sep-2019 11:51:21
04-Sep-2019 11:51:21 > Task :spring-batch-test:compileJava
04-Sep-2019 11:51:21
04-Sep-2019 11:51:21 > Task :spring-batch-test:classes
04-Sep-2019 11:51:21 C:\Windows\System32\config\systemprofile\.gradle\caches\modules-2\files-2.1\org.springframework\spring-core\5.2.0.M3\63ff2e4cf81881c7a20b8e91e18c05f09a9e0eb7\spring-core-5.2.0.M3.jar(org/springframework/lang/Nullable.class): warning: Cannot find annotation method 'when()' in type 'Nonnull': class file for javax.annotation.Nonnull not found
04-Sep-2019 11:51:21 warning: unknown enum constant When.MAYBE
04-Sep-2019 11:51:21   reason: class file for javax.annotation.meta.When not found
04-Sep-2019 11:51:21 C:\Windows\System32\config\systemprofile\.gradle\caches\modules-2\files-2.1\org.springframework\spring-core\5.2.0.M3\63ff2e4cf81881c7a20b8e91e18c05f09a9e0eb7\spring-core-5.2.0.M3.jar(org/springframework/lang/NonNullApi.class): warning: Cannot find annotation method 'value()' in type 'TypeQualifierDefault': class file for javax.annotation.meta.TypeQualifierDefault not found
04-Sep-2019 11:51:21 3 warnings
04-Sep-2019 11:51:21 > Task :spring-batch-test:jar
04-Sep-2019 11:51:21 > Task :spring-batch-core:assemble
04-Sep-2019 11:51:23
04-Sep-2019 11:51:23 > Task :spring-batch-integration:compileJava
04-Sep-2019 11:51:23 C:\opt\bamboo-home\xml-data\build-dir\BATCH-BATCHWIN-JOB1\spring-batch-integration\src\main\java\org\springframework\batch\integration\config\annotation\BatchIntegrationConfiguration.java:20: warning: [deprecation] RemoteChunkingMasterStepBuilderFactory in org.springframework.batch.integration.chunk has been deprecated
04-Sep-2019 11:51:23 import org.springframework.batch.integration.chunk.RemoteChunkingMasterStepBuilderFactory;
04-Sep-2019 11:51:23                                                   ^
04-Sep-2019 11:51:23 C:\opt\bamboo-home\xml-data\build-dir\BATCH-BATCHWIN-JOB1\spring-batch-integration\src\main\java\org\springframework\batch\integration\config\annotation\BatchIntegrationConfiguration.java:23: warning: [deprecation] RemotePartitioningMasterStepBuilderFactory in org.springframework.batch.integration.partition has been deprecated
04-Sep-2019 11:51:23 import org.springframework.batch.integration.partition.RemotePartitioningMasterStepBuilderFactory;
04-Sep-2019 11:51:23                                                       ^
04-Sep-2019 11:51:23 2 warnings
04-Sep-2019 11:51:24
04-Sep-2019 11:51:24 > Task :spring-batch-integration:classes
04-Sep-2019 11:51:25 > Task :spring-batch-integration:jar
04-Sep-2019 11:51:28 > Task :spring-batch-infrastructure-tests:compileTestJava
04-Sep-2019 11:51:29 > Task :spring-batch-core-tests:compileJava
04-Sep-2019 11:51:29 > Task :spring-batch-core-tests:classes
04-Sep-2019 11:51:29 > Task :spring-batch-core-tests:jar
04-Sep-2019 11:51:29 > Task :spring-batch-core-tests:assemble
04-Sep-2019 11:51:30 > Task :spring-batch-core-tests:compileTestJava
04-Sep-2019 11:51:30 > Task :spring-batch-core-tests:testClasses
04-Sep-2019 11:51:30 > Task :spring-batch-core-tests:test SKIPPED
04-Sep-2019 11:51:30 > Task :spring-batch-core-tests:check UP-TO-DATE
04-Sep-2019 11:51:30 > Task :spring-batch-core-tests:build
04-Sep-2019 11:51:30 > Task :spring-batch-infrastructure-tests:testClasses
04-Sep-2019 11:51:30 > Task :spring-batch-infrastructure-tests:test SKIPPED
04-Sep-2019 11:51:30 > Task :spring-batch-infrastructure-tests:check UP-TO-DATE
04-Sep-2019 11:51:30 > Task :spring-batch-infrastructure-tests:build
04-Sep-2019 11:51:30 > Task :spring-batch-integration:assemble
04-Sep-2019 11:51:32 > Task :spring-batch-core:compileTestJava
04-Sep-2019 11:51:32 > Task :spring-batch-core:testClasses
04-Sep-2019 11:51:37
04-Sep-2019 11:51:37 > Task :spring-batch-integration:compileTestJava
04-Sep-2019 11:51:37 C:\opt\bamboo-home\xml-data\build-dir\BATCH-BATCHWIN-JOB1\spring-batch-integration\src\test\java\org\springframework\batch\integration\partition\RemotePartitioningMasterStepBuilderTests.java:62: warning: [deprecation] RemotePartitioningMasterStepBuilder in org.springframework.batch.integration.partition has been deprecated
04-Sep-2019 11:51:37                 new RemotePartitioningMasterStepBuilder("step").inputChannel(null);
04-Sep-2019 11:51:37                     ^
04-Sep-2019 11:51:37 C:\opt\bamboo-home\xml-data\build-dir\BATCH-BATCHWIN-JOB1\spring-batch-integration\src\test\java\org\springframework\batch\integration\partition\RemotePartitioningMasterStepBuilderTests.java:75: warning: [deprecation] RemotePartitioningMasterStepBuilder in org.springframework.batch.integration.partition has been deprecated
04-Sep-2019 11:51:37                 new RemotePartitioningMasterStepBuilder("step").outputChannel(null);
04-Sep-2019 11:51:37                     ^
04-Sep-2019 11:51:37 C:\opt\bamboo-home\xml-data\build-dir\BATCH-BATCHWIN-JOB1\spring-batch-integration\src\test\java\org\springframework\batch\integration\partition\RemotePartitioningMasterStepBuilderTests.java:88: warning: [deprecation] RemotePartitioningMasterStepBuilder in org.springframework.batch.integration.partition has been deprecated
04-Sep-2019 11:51:37                 new RemotePartitioningMasterStepBuilder("step").messagingTemplate(null);
04-Sep-2019 11:51:37                     ^
04-Sep-2019 11:51:37 C:\opt\bamboo-home\xml-data\build-dir\BATCH-BATCHWIN-JOB1\spring-batch-integration\src\test\java\org\springframework\batch\integration\partition\RemotePartitioningMasterStepBuilderTests.java:101: warning: [deprecation] RemotePartitioningMasterStepBuilder in org.springframework.batch.integration.partition has been deprecated
04-Sep-2019 11:51:37                 new RemotePartitioningMasterStepBuilder("step").jobExplorer(null);
04-Sep-2019 11:51:37                     ^
04-Sep-2019 11:51:37 C:\opt\bamboo-home\xml-data\build-dir\BATCH-BATCHWIN-JOB1\spring-batch-integration\src\test\java\org\springframework\batch\integration\partition\RemotePartitioningMasterStepBuilderTests.java:114: warning: [deprecation] RemotePartitioningMasterStepBuilder in org.springframework.batch.integration.partition has been deprecated
04-Sep-2019 11:51:37                 new RemotePartitioningMasterStepBuilder("step").pollInterval(-1);
04-Sep-2019 11:51:37                     ^
04-Sep-2019 11:51:37 C:\opt\bamboo-home\xml-data\build-dir\BATCH-BATCHWIN-JOB1\spring-batch-integration\src\test\java\org\springframework\batch\integration\partition\RemotePartitioningMasterStepBuilderTests.java:123: warning: [deprecation] RemotePartitioningMasterStepBuilder in org.springframework.batch.integration.partition has been deprecated
04-Sep-2019 11:51:37                 RemotePartitioningMasterStepBuilder builder = new RemotePartitioningMasterStepBuilder("step")
04-Sep-2019 11:51:37                 ^
04-Sep-2019 11:51:37 C:\opt\bamboo-home\xml-data\build-dir\BATCH-BATCHWIN-JOB1\spring-batch-integration\src\test\java\org\springframework\batch\integration\partition\RemotePartitioningMasterStepBuilderTests.java:123: warning: [deprecation] RemotePartitioningMasterStepBuilder in org.springframework.batch.integration.partition has been deprecated
04-Sep-2019 11:51:37                 RemotePartitioningMasterStepBuilder builder = new RemotePartitioningMasterStepBuilder("step")
04-Sep-2019 11:51:37                                                                   ^
04-Sep-2019 11:51:37 C:\opt\bamboo-home\xml-data\build-dir\BATCH-BATCHWIN-JOB1\spring-batch-integration\src\test\java\org\springframework\batch\integration\partition\RemotePartitioningMasterStepBuilderTests.java:149: warning: [deprecation] RemotePartitioningMasterStepBuilder in org.springframework.batch.integration.partition has been deprecated
04-Sep-2019 11:51:37                 new RemotePartitioningMasterStepBuilder("step").partitionHandler(partitionHandler);
04-Sep-2019 11:51:37                     ^
04-Sep-2019 11:51:37 C:\opt\bamboo-home\xml-data\build-dir\BATCH-BATCHWIN-JOB1\spring-batch-integration\src\test\java\org\springframework\batch\integration\partition\RemotePartitioningMasterStepBuilderTests.java:167: warning: [deprecation] RemotePartitioningMasterStepBuilder in org.springframework.batch.integration.partition has been deprecated
04-Sep-2019 11:51:37                 Step step = new RemotePartitioningMasterStepBuilder("masterStep")
04-Sep-2019 11:51:37                                 ^
04-Sep-2019 11:51:37 C:\opt\bamboo-home\xml-data\build-dir\BATCH-BATCHWIN-JOB1\spring-batch-integration\src\test\java\org\springframework\batch\integration\partition\RemotePartitioningMasterStepBuilderTests.java:210: warning: [deprecation] RemotePartitioningMasterStepBuilder in org.springframework.batch.integration.partition has been deprecated
04-Sep-2019 11:51:37                 Step step = new RemotePartitioningMasterStepBuilder("masterStep")
04-Sep-2019 11:51:37                                 ^
04-Sep-2019 11:51:37 10 warnings
04-Sep-2019 11:51:42
04-Sep-2019 11:51:42 > Task :spring-batch-infrastructure:compileTestJava
04-Sep-2019 11:51:42 C:\opt\bamboo-home\xml-data\build-dir\BATCH-BATCHWIN-JOB1\spring-batch-infrastructure\src\test\java\org\springframework\batch\item\avro\builder\AvroItemWriterBuilderTests.java:117: warning: [rawtypes] found raw type: AvroItemWriterBuilder
04-Sep-2019 11:51:42                 new AvroItemWriterBuilder()
04-Sep-2019 11:51:42                     ^
04-Sep-2019 11:51:42   missing type arguments for generic class AvroItemWriterBuilder<T>
04-Sep-2019 11:51:42   where T is a type-variable:
04-Sep-2019 11:51:42     T extends Object declared in class AvroItemWriterBuilder
04-Sep-2019 11:51:43
04-Sep-2019 11:51:43 > Task :spring-batch-integration:testClasses
04-Sep-2019 11:51:54 C:\opt\bamboo-home\xml-data\build-dir\BATCH-BATCHWIN-JOB1\spring-batch-infrastructure\src\test\java\org\springframework\batch\item\kafka\KafkaItemReaderTests.java:275: warning: [rawtypes] found raw type: ListenableFuture
04-Sep-2019 11:51:54                 List<ListenableFuture> futures = new ArrayList<>();
04-Sep-2019 11:51:54                      ^
04-Sep-2019 11:51:54   missing type arguments for generic class ListenableFuture<T>
04-Sep-2019 11:51:54   where T is a type-variable:
04-Sep-2019 11:51:54     T extends Object declared in interface ListenableFuture
04-Sep-2019 11:51:54 C:\opt\bamboo-home\xml-data\build-dir\BATCH-BATCHWIN-JOB1\spring-batch-infrastructure\src\test\java\org\springframework\batch\item\kafka\KafkaItemReaderTests.java:285: warning: [rawtypes] found raw type: ListenableFuture
04-Sep-2019 11:51:54                 for (ListenableFuture future : futures) {
04-Sep-2019 11:51:54                      ^
04-Sep-2019 11:51:54   missing type arguments for generic class ListenableFuture<T>
04-Sep-2019 11:51:54   where T is a type-variable:
04-Sep-2019 11:51:54     T extends Object declared in interface ListenableFuture
04-Sep-2019 11:51:55
04-Sep-2019 11:51:55 > Task :spring-batch-infrastructure:compileTestJava
04-Sep-2019 11:51:55
04-Sep-2019 11:51:55 > Task :api
04-Sep-2019 11:52:02 > Task :spring-batch-core:test
04-Sep-2019 11:52:13 > Task :spring-batch-integration:test
04-Sep-2019 11:52:13
04-Sep-2019 11:52:13 3 warnings
04-Sep-2019 11:52:13 > Task :spring-batch-infrastructure:compileTestJava
04-Sep-2019 11:52:14
04-Sep-2019 11:52:14 > Task :spring-batch-infrastructure:processTestResources
04-Sep-2019 11:52:14 > Task :spring-batch-infrastructure:testClasses
04-Sep-2019 11:52:17
04-Sep-2019 11:52:17 C:\opt\bamboo-home\xml-data\build-dir\BATCH-BATCHWIN-JOB1\spring-batch-core\src\main\java\org\springframework\batch\core\metrics\BatchMetrics.java:76: warning - Tag @link: reference not found: Timer.Sample
04-Sep-2019 11:52:17 > Task :api
04-Sep-2019 11:52:17 C:\opt\bamboo-home\xml-data\build-dir\BATCH-BATCHWIN-JOB1\spring-batch-core\src\main\java\org\springframework\batch\core\metrics\BatchMetrics.java:76: warning - Tag @link: reference not found: Timer.Sample
04-Sep-2019 11:52:32 C:\opt\bamboo-home\xml-data\build-dir\BATCH-BATCHWIN-JOB1\spring-batch-core\src\main\java\org\springframework\batch\core\metrics\BatchMetrics.java:76: warning - Tag @link: reference not found: Timer.Sample
04-Sep-2019 11:52:35
04-Sep-2019 11:52:35 > Task :docsZip
04-Sep-2019 11:52:36 > Task :distZip
04-Sep-2019 11:52:36 > Task :assemble
04-Sep-2019 11:52:36 > Task :build
04-Sep-2019 11:52:36
04-Sep-2019 11:52:36 > Task :spring-batch-core:test
04-Sep-2019 11:52:36
04-Sep-2019 11:52:36 org.springframework.batch.core.repository.dao.OptimisticLockingFailureTests > testAsyncStopOfStartingJob FAILED
04-Sep-2019 11:52:36     org.springframework.batch.core.repository.JobExecutionAlreadyRunningException at OptimisticLockingFailureTests.java:72
04-Sep-2019 11:52:38
04-Sep-2019 11:52:38 > Task :spring-batch-samples:compileJava
04-Sep-2019 11:52:38 > Task :spring-batch-samples:classes
04-Sep-2019 11:52:39 > Task :spring-batch-samples:jar
04-Sep-2019 11:52:39 > Task :spring-batch-samples:assemble
04-Sep-2019 11:52:44 > Task :spring-batch-infrastructure:test
04-Sep-2019 11:52:47
04-Sep-2019 11:52:47 1909 tests completed, 1 failed, 7 skipped
04-Sep-2019 11:52:47 > Task :spring-batch-samples:compileTestJava
04-Sep-2019 11:52:47 > Task :spring-batch-samples:testClasses
04-Sep-2019 11:52:47
04-Sep-2019 11:52:47 > Task :spring-batch-core:test
04-Sep-2019 11:52:49
04-Sep-2019 11:52:49 > Task :spring-batch-core:test FAILED
04-Sep-2019 11:52:50 > Task :artifactoryDeploy
04-Sep-2019 11:53:17 > Task :spring-batch-samples:test
04-Sep-2019 11:53:58
04-Sep-2019 11:53:58 81 actionable tasks: 72 executed, 9 up-to-date
04-Sep-2019 11:53:58 FAILURE: Build failed with an exception.
04-Sep-2019 11:53:58
04-Sep-2019 11:53:58 * What went wrong:
04-Sep-2019 11:53:58 Execution failed for task ':spring-batch-core:test'.
04-Sep-2019 11:53:58 > There were failing tests. See the report at: file:///C:/opt/bamboo-home/xml-data/build-dir/BATCH-BATCHWIN-JOB1/spring-batch-core/build/reports/tests/test/index.html
04-Sep-2019 11:53:58
04-Sep-2019 11:53:58 * Try:
04-Sep-2019 11:53:58 Run with --stacktrace option to get the stack trace. Run with --info or --debug option to get more log output. Run with --scan to get full insights.
04-Sep-2019 11:53:58
04-Sep-2019 11:53:58 * Get more help at https://help.gradle.org
04-Sep-2019 11:53:58
04-Sep-2019 11:53:58 BUILD FAILED in 5m 45s
04-Sep-2019 11:53:59
04-Sep-2019 11:53:59 Failing task since return code of [./gradlew.bat -x javadoc -x asciidoc -x makePDF --parallel clean build jacocoTestReport -I C:\Windows\System32\config\systemprofile\AppData\Local\Temp\artifactory.init.script2014427264935215145gradle -DbuildInfoConfig.propertiesFile=C:\Windows\System32\config\systemprofile\AppData\Local\Temp\buildinfo1011728021352130519properties artifactoryPublish -Dartifactory.resolve.password=******** -Dartifactory.publish.password=********] was 1 while expected 0
04-Sep-2019 11:53:59 Parsing test results under C:\opt\bamboo-home\xml-data\build-dir\BATCH-BATCHWIN-JOB1...
04-Sep-2019 11:54:00 Finished task 'Gradle build' with result: Failed
04-Sep-2019 11:54:00 Running post build plugin 'Docker Container Cleanup'
04-Sep-2019 11:54:00 Running post build plugin 'NCover Results Collector'
04-Sep-2019 11:54:00 Running post build plugin 'Artifactory Release Management Staging'
04-Sep-2019 11:54:00 Running post build plugin 'Artifactory Build Info Copier'
04-Sep-2019 11:54:00 Running post build plugin 'Artifactory Gradle Properties Info Copier'
04-Sep-2019 11:54:00 Running post build plugin 'Clover Results Collector'
04-Sep-2019 11:54:00 Running post build plugin 'npm Cache Cleanup'
04-Sep-2019 11:54:00 Running post build plugin 'Artifact Copier'
04-Sep-2019 11:54:00 Publishing an artifact: Test Results
04-Sep-2019 11:54:01 Finished publishing of artifact Non required job artifact: [Test Results], pattern: [*/build/reports/tests/**/*.*] in 351.3 ms
04-Sep-2019 11:54:01 Publishing an artifact: Coverage Report
04-Sep-2019 11:54:01 Finished publishing of artifact Non required job artifact: [Coverage Report], pattern: [*/build/reports/jacoco/test/html/**/*.*] in 34.46 ms
04-Sep-2019 11:54:03 Successfully removed working directory at 'C:\opt\bamboo-home\xml-data\build-dir\BATCH-BATCHWIN-JOB1'
04-Sep-2019 11:54:03 Finalising the build...
04-Sep-2019 11:54:03 Stopping timer.
04-Sep-2019 11:54:03 Build BATCH-BATCHWIN-JOB1-141 completed.
04-Sep-2019 11:54:03 Running on server: post build plugin 'NCover Results Collector'
04-Sep-2019 11:54:03 Running on server: post build plugin 'Build Hanging Detection Configuration'
04-Sep-2019 11:54:03 Running on server: post build plugin 'Bamboo project link creator'
04-Sep-2019 11:54:03 Running on server: post build plugin 'Clover Delta Calculator'
04-Sep-2019 11:54:03 Running on server: post build plugin 'Maven Dependencies Postprocessor'
04-Sep-2019 11:54:03 All post build plugins have finished
04-Sep-2019 11:54:03 Generating build results summary...
04-Sep-2019 11:54:05 Saving build results to disk...
04-Sep-2019 11:54:05 Logging substituted variables...
04-Sep-2019 11:54:05 Indexing build results...
04-Sep-2019 11:54:05 Finished building BATCH-BATCHWIN-JOB1-141.