Build #148

Build plan for MS Windows

Build: #148 failed

Job: Default Job failed

Stages & jobs

  1. Default Stage

Job result summary

Completed
Duration
3 minutes
Agent
bamboo-2k16-02
Revision
badba4ff4b523b134aaf0e4dda63805c8e1553fc badba4ff4b523b134aaf0e4dda63805c8e1553fc
Total tests
3796
Failing since
#141 (Code changes detected – )
Fixed in
#156 (Code changes detected)

Tests

  • 3,796 tests in total
  • 4 tests failed
  • 4 failures are new
  • 2 tests were fixed
  • 10 tests were quarantined / skipped
  • 4 minutes taken in total.
New test failures 4
Status Test Duration
Collapse Failed SplitInterruptedJobParserTests testSplitInterrupted History
< 1 sec
org.junit.ComparisonFailure: org.junit.ComparisonFailure: expected:<[STOPPED]> but was:<[NOOP]>
org.junit.ComparisonFailure: expected:<[STOPPED]> but was:<[NOOP]>
	at org.junit.Assert.assertEquals(Assert.java:115)
	at org.junit.Assert.assertEquals(Assert.java:144)
	at org.springframework.batch.core.configuration.xml.SplitInterruptedJobParserTests.testSplitInterrupted(SplitInterruptedJobParserTests.java:59)
	at sun.reflect.NativeMethodAccessorImpl.invoke0(Native Method)
	at sun.reflect.NativeMethodAccessorImpl.invoke(NativeMethodAccessorImpl.java:62)
	at sun.reflect.DelegatingMethodAccessorImpl.invoke(DelegatingMethodAccessorImpl.java:43)
(51 more lines...)
Collapse Failed FlowParserTests testWildcardAddedLastWhenUsedWithNextAttrAndNoTransitionElements History
1 sec
java.util.concurrent.TimeoutException: java.util.concurrent.TimeoutException: Job processing did not complete in time
java.util.concurrent.TimeoutException: Job processing did not complete in time
	at org.springframework.batch.core.jsr.AbstractJsrTestCase.runJob(AbstractJsrTestCase.java:66)
	at org.springframework.batch.core.jsr.configuration.xml.FlowParserTests.testWildcardAddedLastWhenUsedWithNextAttrAndNoTransitionElements(FlowParserTests.java:55)
	at sun.reflect.NativeMethodAccessorImpl.invoke0(Native Method)
	at sun.reflect.NativeMethodAccessorImpl.invoke(NativeMethodAccessorImpl.java:62)
	at sun.reflect.DelegatingMethodAccessorImpl.invoke(DelegatingMethodAccessorImpl.java:43)
	at java.lang.reflect.Method.invoke(Method.java:498)
(41 more lines...)
Collapse Failed JsrPartitionHandlerTests testPollingPartitionsCompletion History
1 sec
java.lang.AssertionError: java.lang.AssertionError
java.lang.AssertionError
	at org.junit.Assert.fail(Assert.java:86)
	at org.junit.Assert.assertTrue(Assert.java:41)
	at org.junit.Assert.assertTrue(Assert.java:52)
	at org.springframework.batch.core.jsr.partition.JsrPartitionHandlerTests.testPollingPartitionsCompletion(JsrPartitionHandlerTests.java:156)
	at sun.reflect.NativeMethodAccessorImpl.invoke0(Native Method)
	at sun.reflect.NativeMethodAccessorImpl.invoke(NativeMethodAccessorImpl.java:62)
(44 more lines...)
Collapse Failed DecisionStepTests testDecisionAfterSplit History
< 1 sec
java.lang.AssertionError: java.lang.AssertionError: Received a FAILED because of org.springframework.batch.core.JobExecutionException: Flow execution ended unexpectedly
	at org.springframework.batch.core.jsr.job.flow.JsrFlowJob.doExecute(JsrFlowJob.java:88)
	at org.springframework.batch.core.job.AbstractJob.execute(AbstractJob.java:319)
	at org.springframework.batch.core.jsr.launch.JsrJobOperator$2.run(JsrJobOperator.java:674)
	at java.lang.Thread.run(Thread.java:748)
Caused by: org.springframework.batch.core.job.flow.FlowExecutionException: Ended flow=flow2.step1 at state=flow2.step1.flow2.step1 with exception
	at org.springframework.batch.core.job.flow.support.SimpleFlow.resume(SimpleFlow.java:178)
	at org.springframework.batch.core.job.flow.support.SimpleFlow.start(SimpleFlow.java:144)
(90 more lines...)
Fixed tests 2
Status Test Failing since Duration
Successful JsrSplitParsingTests test History
Failing since build #146 (Code changes detected) < 1 sec
Successful RetryRepeatTransactionalPollingIntegrationTests testSunnyDay History
Failing since build #147 (Code changes detected) < 1 sec

Error summary

The build generated some errors. See the full build log for more details.

                                       ^
  where I,O are type-variables:
    I extends Object declared in class SimpleStepBuilder
    O extends Object declared in class SimpleStepBuilder
C:\opt\bamboo-home\xml-data\build-dir\BATCH-BATCHWIN-JOB1\spring-batch-core\src\main\java\org\springframework\batch\core\configuration\support\AbstractApplicationContextFactory.java:75: warning: [deprecation] PropertyPlaceholderConfigurer in org.springframework.beans.factory.config has been deprecated
                beanFactoryPostProcessorClasses.add(PropertyPlaceholderConfigurer.class);
                                                    ^
C:\opt\bamboo-home\xml-data\build-dir\BATCH-BATCHWIN-JOB1\spring-batch-core\src\main\java\org\springframework\batch\core\jsr\configuration\support\SpringAutowiredAnnotationBeanPostProcessor.java:264: warning: [deprecation] postProcessPropertyValues(PropertyValues,PropertyDescriptor[],Object,String) in InstantiationAwareBeanPostProcessorAdapter has been deprecated
    public PropertyValues postProcessPropertyValues(
                          ^
C:\opt\bamboo-home\xml-data\build-dir\BATCH-BATCHWIN-JOB1\spring-batch-core\src\main\java\org\springframework\batch\core\jsr\configuration\support\SpringAutowiredAnnotationBeanPostProcessor.java:543: warning: [deprecation] resolveParameterType(MethodParameter,Class<?>) in GenericTypeResolver has been deprecated
                        GenericTypeResolver.resolveParameterType(methodParam, bean.getClass());
                                           ^
6 warnings
C:\opt\bamboo-home\xml-data\build-dir\BATCH-BATCHWIN-JOB1\spring-batch-infrastructure\src\test\java\org\springframework\batch\item\avro\builder\AvroItemWriterBuilderTests.java:117: warning: [rawtypes] found raw type: AvroItemWriterBuilder
                new AvroItemWriterBuilder()
                    ^
  missing type arguments for generic class AvroItemWriterBuilder<T>
  where T is a type-variable:
    T extends Object declared in class AvroItemWriterBuilder
C:\opt\bamboo-home\xml-data\build-dir\BATCH-BATCHWIN-JOB1\spring-batch-infrastructure\src\test\java\org\springframework\batch\item\data\builder\MongoItemReaderBuilderTests.java:103: warning: [deprecation] getHint() in Query has been deprecated
                assertEquals("{ $natural : 1}", query.getHint());
                                                     ^
C:\Windows\System32\config\systemprofile\.gradle\caches\modules-2\files-2.1\org.springframework\spring-core\5.2.0.RC2\338a5bc5b73b608ddf5e24003c5661f0dd45da4b\spring-core-5.2.0.RC2.jar(org/springframework/lang/Nullable.class): warning: Cannot find annotation method 'when()' in type 'Nonnull': class file for javax.annotation.Nonnull not found
warning: unknown enum constant When.MAYBE
  reason: class file for javax.annotation.meta.When not found
C:\Windows\System32\config\systemprofile\.gradle\caches\modules-2\files-2.1\org.springframework\spring-core\5.2.0.RC2\338a5bc5b73b608ddf5e24003c5661f0dd45da4b\spring-core-5.2.0.RC2.jar(org/springframework/lang/NonNullApi.class): warning: Cannot find annotation method 'value()' in type 'TypeQualifierDefault': class file for javax.annotation.meta.TypeQualifierDefault not found
3 warnings
C:\opt\bamboo-home\xml-data\build-dir\BATCH-BATCHWIN-JOB1\spring-batch-integration\src\main\java\org\springframework\batch\integration\config\annotation\BatchIntegrationConfiguration.java:20: warning: [deprecation] RemoteChunkingMasterStepBuilderFactory in org.springframework.batch.integration.chunk has been deprecated
import org.springframework.batch.integration.chunk.RemoteChunkingMasterStepBuilderFactory;
                                                  ^
C:\opt\bamboo-home\xml-data\build-dir\BATCH-BATCHWIN-JOB1\spring-batch-integration\src\main\java\org\springframework\batch\integration\config\annotation\BatchIntegrationConfiguration.java:23: warning: [deprecation] RemotePartitioningMasterStepBuilderFactory in org.springframework.batch.integration.partition has been deprecated
import org.springframework.batch.integration.partition.RemotePartitioningMasterStepBuilderFactory;
                                                      ^
2 warnings
C:\opt\bamboo-home\xml-data\build-dir\BATCH-BATCHWIN-JOB1\spring-batch-infrastructure\src\test\java\org\springframework\batch\item\data\MongoItemReaderTests.java:194: warning: [deprecation] getHint() in Query has been deprecated
                assertEquals("{ $natural : 1}", query.getHint());
                                                     ^
C:\opt\bamboo-home\xml-data\build-dir\BATCH-BATCHWIN-JOB1\spring-batch-infrastructure\src\test\java\org\springframework\batch\item\kafka\KafkaItemReaderTests.java:275: warning: [rawtypes] found raw type: ListenableFuture
                List<ListenableFuture> futures = new ArrayList<>();
                     ^
  missing type arguments for generic class ListenableFuture<T>
  where T is a type-variable:
    T extends Object declared in interface ListenableFuture
C:\opt\bamboo-home\xml-data\build-dir\BATCH-BATCHWIN-JOB1\spring-batch-infrastructure\src\test\java\org\springframework\batch\item\kafka\KafkaItemReaderTests.java:285: warning: [rawtypes] found raw type: ListenableFuture
                for (ListenableFuture future : futures) {
                     ^
  missing type arguments for generic class ListenableFuture<T>
  where T is a type-variable:
    T extends Object declared in interface ListenableFuture
5 warnings
C:\opt\bamboo-home\xml-data\build-dir\BATCH-BATCHWIN-JOB1\spring-batch-integration\src\test\java\org\springframework\batch\integration\partition\RemotePartitioningMasterStepBuilderTests.java:62: warning: [deprecation] RemotePartitioningMasterStepBuilder in org.springframework.batch.integration.partition has been deprecated
                new RemotePartitioningMasterStepBuilder("step").inputChannel(null);
                    ^
C:\opt\bamboo-home\xml-data\build-dir\BATCH-BATCHWIN-JOB1\spring-batch-integration\src\test\java\org\springframework\batch\integration\partition\RemotePartitioningMasterStepBuilderTests.java:75: warning: [deprecation] RemotePartitioningMasterStepBuilder in org.springframework.batch.integration.partition has been deprecated
                new RemotePartitioningMasterStepBuilder("step").outputChannel(null);
                    ^
C:\opt\bamboo-home\xml-data\build-dir\BATCH-BATCHWIN-JOB1\spring-batch-integration\src\test\java\org\springframework\batch\integration\partition\RemotePartitioningMasterStepBuilderTests.java:88: warning: [deprecation] RemotePartitioningMasterStepBuilder in org.springframework.batch.integration.partition has been deprecated
                new RemotePartitioningMasterStepBuilder("step").messagingTemplate(null);
                    ^
C:\opt\bamboo-home\xml-data\build-dir\BATCH-BATCHWIN-JOB1\spring-batch-integration\src\test\java\org\springframework\batch\integration\partition\RemotePartitioningMasterStepBuilderTests.java:101: warning: [deprecation] RemotePartitioningMasterStepBuilder in org.springframework.batch.integration.partition has been deprecated
                new RemotePartitioningMasterStepBuilder("step").jobExplorer(null);
                    ^
C:\opt\bamboo-home\xml-data\build-dir\BATCH-BATCHWIN-JOB1\spring-batch-integration\src\test\java\org\springframework\batch\integration\partition\RemotePartitioningMasterStepBuilderTests.java:114: warning: [deprecation] RemotePartitioningMasterStepBuilder in org.springframework.batch.integration.partition has been deprecated
                new RemotePartitioningMasterStepBuilder("step").pollInterval(-1);
                    ^
C:\opt\bamboo-home\xml-data\build-dir\BATCH-BATCHWIN-JOB1\spring-batch-integration\src\test\java\org\springframework\batch\integration\partition\RemotePartitioningMasterStepBuilderTests.java:123: warning: [deprecation] RemotePartitioningMasterStepBuilder in org.springframework.batch.integration.partition has been deprecated
                RemotePartitioningMasterStepBuilder builder = new RemotePartitioningMasterStepBuilder("step")
                ^
C:\opt\bamboo-home\xml-data\build-dir\BATCH-BATCHWIN-JOB1\spring-batch-integration\src\test\java\org\springframework\batch\integration\partition\RemotePartitioningMasterStepBuilderTests.java:123: warning: [deprecation] RemotePartitioningMasterStepBuilder in org.springframework.batch.integration.partition has been deprecated
                RemotePartitioningMasterStepBuilder builder = new RemotePartitioningMasterStepBuilder("step")
                                                                  ^
C:\opt\bamboo-home\xml-data\build-dir\BATCH-BATCHWIN-JOB1\spring-batch-integration\src\test\java\org\springframework\batch\integration\partition\RemotePartitioningMasterStepBuilderTests.java:149: warning: [deprecation] RemotePartitioningMasterStepBuilder in org.springframework.batch.integration.partition has been deprecated
                new RemotePartitioningMasterStepBuilder("step").partitionHandler(partitionHandler);
                    ^
C:\opt\bamboo-home\xml-data\build-dir\BATCH-BATCHWIN-JOB1\spring-batch-integration\src\test\java\org\springframework\batch\integration\partition\RemotePartitioningMasterStepBuilderTests.java:167: warning: [deprecation] RemotePartitioningMasterStepBuilder in org.springframework.batch.integration.partition has been deprecated
                Step step = new RemotePartitioningMasterStepBuilder("masterStep")
                                ^
C:\opt\bamboo-home\xml-data\build-dir\BATCH-BATCHWIN-JOB1\spring-batch-integration\src\test\java\org\springframework\batch\integration\partition\RemotePartitioningMasterStepBuilderTests.java:210: warning: [deprecation] RemotePartitioningMasterStepBuilder in org.springframework.batch.integration.partition has been deprecated
                Step step = new RemotePartitioningMasterStepBuilder("masterStep")
                                ^
10 warnings
C:\opt\bamboo-home\xml-data\build-dir\BATCH-BATCHWIN-JOB1\spring-batch-core\src\main\java\org\springframework\batch\core\metrics\BatchMetrics.java:73: warning - Tag @link: reference not found: Timer.Sample
C:\opt\bamboo-home\xml-data\build-dir\BATCH-BATCHWIN-JOB1\spring-batch-core\src\main\java\org\springframework\batch\core\metrics\BatchMetrics.java:73: warning - Tag @link: reference not found: Timer.Sample
C:\opt\bamboo-home\xml-data\build-dir\BATCH-BATCHWIN-JOB1\spring-batch-core\src\main\java\org\springframework\batch\core\metrics\BatchMetrics.java:73: warning - Tag @link: reference not found: Timer.Sample

1913 tests completed, 4 failed, 7 skipped

FAILURE: Build failed with an exception.

* What went wrong:
Execution failed for task ':spring-batch-core:test'.
> There were failing tests. See the report at: file:///C:/opt/bamboo-home/xml-data/build-dir/BATCH-BATCHWIN-JOB1/spring-batch-core/build/reports/tests/test/index.html

* Try:
Run with --stacktrace option to get the stack trace. Run with --info or --debug option to get more log output. Run with --scan to get full insights.

* Get more help at https://help.gradle.org

BUILD FAILED in 3m 27s