Build #218

Build plan for MS Windows

Build: #218 failed

Job: Default Job failed

Stages & jobs

  1. Default Stage

Job result summary

Completed
Duration
3 minutes
Agent
bamboo-2k16-02
Revision
ae6cd5915569b79a81db68ae243ccdc864622e01 ae6cd5915569b79a81db68ae243ccdc864622e01
Total tests
1917
Failing since
#214 (Code changes detected – )
Fixed in
#222 (Manual run by Mahmoud Ben Hassine)

Tests

  • 1,917 tests in total
  • 1 test failed
  • 1 test was fixed
  • 7 tests were quarantined / skipped
  • 46 seconds taken in total.
Existing test failures 1
Status Test Failing since Duration
java.lang.AssertionError: java.lang.AssertionError
java.lang.AssertionError
	at org.junit.Assert.fail(Assert.java:87)
	at org.junit.Assert.assertTrue(Assert.java:42)
	at org.junit.Assert.assertTrue(Assert.java:53)
	at org.springframework.batch.core.jsr.partition.JsrPartitionHandlerTests.testPollingPartitionsCompletion(JsrPartitionHandlerTests.java:156)
	at sun.reflect.NativeMethodAccessorImpl.invoke0(Native Method)
	at sun.reflect.NativeMethodAccessorImpl.invoke(NativeMethodAccessorImpl.java:62)
(47 more lines...)
Fixed tests 1
Status Test Failing since Duration
Successful JsrSplitParsingTests test History
Failing since build #217 (Code changes detected) < 1 sec

Error summary

The build generated some errors. See the full build log for more details.

                                                    ^
C:\opt\bamboo-home\xml-data\build-dir\BATCH-BATCHWIN-JOB1\spring-batch-core\src\main\java\org\springframework\batch\core\repository\support\AbstractJobRepositoryFactoryBean.java:168: warning: [deprecation] TransactionInterceptor(PlatformTransactionManager,Properties) in TransactionInterceptor has been deprecated
                        TransactionInterceptor advice = new TransactionInterceptor(transactionManager,
                                                        ^
C:\opt\bamboo-home\xml-data\build-dir\BATCH-BATCHWIN-JOB1\spring-batch-core\src\main\java\org\springframework\batch\core\jsr\configuration\support\SpringAutowiredAnnotationBeanPostProcessor.java:264: warning: [deprecation] postProcessPropertyValues(PropertyValues,PropertyDescriptor[],Object,String) in InstantiationAwareBeanPostProcessorAdapter has been deprecated
    public PropertyValues postProcessPropertyValues(
                          ^
C:\opt\bamboo-home\xml-data\build-dir\BATCH-BATCHWIN-JOB1\spring-batch-core\src\main\java\org\springframework\batch\core\jsr\configuration\support\SpringAutowiredAnnotationBeanPostProcessor.java:543: warning: [deprecation] resolveParameterType(MethodParameter,Class<?>) in GenericTypeResolver has been deprecated
                        GenericTypeResolver.resolveParameterType(methodParam, bean.getClass());
                                           ^
C:\opt\bamboo-home\xml-data\build-dir\BATCH-BATCHWIN-JOB1\spring-batch-core\src\main\java\org\springframework\batch\core\repository\dao\Jackson2ExecutionContextStringSerializer.java:58: warning: [deprecation] enableDefaultTyping() in ObjectMapper has been deprecated
        this.objectMapper.enableDefaultTyping();
                         ^
8 warnings
C:\opt\bamboo-home\xml-data\build-dir\BATCH-BATCHWIN-JOB1\spring-batch-integration\src\main\java\org\springframework\batch\integration\config\annotation\BatchIntegrationConfiguration.java:20: warning: [deprecation] RemoteChunkingMasterStepBuilderFactory in org.springframework.batch.integration.chunk has been deprecated
import org.springframework.batch.integration.chunk.RemoteChunkingMasterStepBuilderFactory;
                                                  ^
C:\opt\bamboo-home\xml-data\build-dir\BATCH-BATCHWIN-JOB1\spring-batch-integration\src\main\java\org\springframework\batch\integration\config\annotation\BatchIntegrationConfiguration.java:23: warning: [deprecation] RemotePartitioningMasterStepBuilderFactory in org.springframework.batch.integration.partition has been deprecated
import org.springframework.batch.integration.partition.RemotePartitioningMasterStepBuilderFactory;
                                                      ^
2 warnings
C:\opt\bamboo-home\xml-data\build-dir\BATCH-BATCHWIN-JOB1\spring-batch-core\src\main\java\org\springframework\batch\core\metrics\BatchMetrics.java:73: warning - Tag @link: reference not found: Timer.Sample
C:\opt\bamboo-home\xml-data\build-dir\BATCH-BATCHWIN-JOB1\spring-batch-core\src\main\java\org\springframework\batch\core\metrics\BatchMetrics.java:73: warning - Tag @link: reference not found: Timer.Sample
C:\opt\bamboo-home\xml-data\build-dir\BATCH-BATCHWIN-JOB1\spring-batch-core\src\main\java\org\springframework\batch\core\metrics\BatchMetrics.java:73: warning - Tag @link: reference not found: Timer.Sample
C:\opt\bamboo-home\xml-data\build-dir\BATCH-BATCHWIN-JOB1\spring-batch-infrastructure\src\main\java\org\springframework\batch\item\avro\builder\AvroItemReaderBuilder.java:104: warning: no @return
        public AvroItemReaderBuilder<T> embeddedSchema(boolean embeddedSchema) {
                                        ^
C:\Windows\System32\config\systemprofile\.gradle\caches\modules-2\files-2.1\org.springframework\spring-core\5.3.0-SNAPSHOT\1a3b7c86794f6b317e539bb088b5089745a0feff\spring-core-5.3.0-SNAPSHOT.jar(org/springframework/lang/Nullable.class): warning: Cannot find annotation method 'when()' in type 'Nonnull': class file for javax.annotation.Nonnull not found
warning: unknown enum constant When.MAYBE
  reason: class file for javax.annotation.meta.When not found
C:\Windows\System32\config\systemprofile\.gradle\caches\modules-2\files-2.1\org.springframework\spring-core\5.3.0-SNAPSHOT\1a3b7c86794f6b317e539bb088b5089745a0feff\spring-core-5.3.0-SNAPSHOT.jar(org/springframework/lang/NonNullApi.class): warning: Cannot find annotation method 'value()' in type 'TypeQualifierDefault': class file for javax.annotation.meta.TypeQualifierDefault not found
3 warnings
warning: unknown enum constant When.MAYBE
  reason: class file for javax.annotation.meta.When not found
C:\opt\bamboo-home\xml-data\build-dir\BATCH-BATCHWIN-JOB1\spring-batch-core\src\test\java\org\springframework\batch\core\resource\ListPreparedStatementSetterTests.java:37: warning: [deprecation] ListPreparedStatementSetter in org.springframework.batch.item.database.support has been deprecated
import org.springframework.batch.item.database.support.ListPreparedStatementSetter;
                                                      ^
C:\opt\bamboo-home\xml-data\build-dir\BATCH-BATCHWIN-JOB1\spring-batch-core\src\test\java\org\springframework\batch\core\configuration\annotation\JobScopeConfigurationTests.java:61: warning: [deprecation] none() in ExpectedException has been deprecated
        public ExpectedException expected = ExpectedException.none();
                                                             ^
C:\opt\bamboo-home\xml-data\build-dir\BATCH-BATCHWIN-JOB1\spring-batch-core\src\test\java\org\springframework\batch\core\configuration\annotation\StepScopeConfigurationTests.java:59: warning: [deprecation] none() in ExpectedException has been deprecated
        public ExpectedException expected = ExpectedException.none();
                                                             ^
C:\opt\bamboo-home\xml-data\build-dir\BATCH-BATCHWIN-JOB1\spring-batch-core\src\test\java\org\springframework\batch\core\JobParametersBuilderTests.java:63: warning: [deprecation] none() in ExpectedException has been deprecated
        public ExpectedException expectedException = ExpectedException.none();
                                                                      ^
C:\opt\bamboo-home\xml-data\build-dir\BATCH-BATCHWIN-JOB1\spring-batch-core\src\test\java\org\springframework\batch\core\jsr\configuration\xml\JsrSplitParsingTests.java:44: warning: [deprecation] none() in ExpectedException has been deprecated
        public ExpectedException expectedException = ExpectedException.none();
                                                                      ^
C:\opt\bamboo-home\xml-data\build-dir\BATCH-BATCHWIN-JOB1\spring-batch-core\src\test\java\org\springframework\batch\core\resource\ListPreparedStatementSetterTests.java:55: warning: [deprecation] ListPreparedStatementSetter in org.springframework.batch.item.database.support has been deprecated
        ListPreparedStatementSetter pss;
        ^
C:\opt\bamboo-home\xml-data\build-dir\BATCH-BATCHWIN-JOB1\spring-batch-core\src\test\java\org\springframework\batch\core\resource\ListPreparedStatementSetterTests.java:81: warning: [deprecation] ListPreparedStatementSetter in org.springframework.batch.item.database.support has been deprecated
                pss = new ListPreparedStatementSetter(parameters);
                          ^
C:\opt\bamboo-home\xml-data\build-dir\BATCH-BATCHWIN-JOB1\spring-batch-core\src\test\java\org\springframework\batch\core\resource\ListPreparedStatementSetterTests.java:105: warning: [deprecation] ListPreparedStatementSetter in org.springframework.batch.item.database.support has been deprecated
                pss = new ListPreparedStatementSetter(null);
                          ^
C:\opt\bamboo-home\xml-data\build-dir\BATCH-BATCHWIN-JOB1\spring-batch-core\src\test\java\org\springframework\batch\core\step\item\FaultTolerantStepFactoryBeanRollbackTests.java:137: warning: [deprecation] <T>assertThat(T,Matcher<? super T>) in Assert has been deprecated
                assertThat(e, instanceOf(FatalStepExecutionException.class));
                ^
  where T is a type-variable:
    T extends Object declared in method <T>assertThat(T,Matcher<? super T>)
C:\opt\bamboo-home\xml-data\build-dir\BATCH-BATCHWIN-JOB1\spring-batch-core\src\test\java\org\springframework\batch\core\step\item\FaultTolerantStepFactoryBeanRollbackTests.java:138: warning: [deprecation] <T>assertThat(T,Matcher<? super T>) in Assert has been deprecated
                assertThat(e.getCause(), instanceOf(IllegalArgumentException.class));
                ^
  where T is a type-variable:
    T extends Object declared in method <T>assertThat(T,Matcher<? super T>)
C:\opt\bamboo-home\xml-data\build-dir\BATCH-BATCHWIN-JOB1\spring-batch-core\src\test\java\org\springframework\batch\core\step\item\FaultTolerantStepFactoryBeanRollbackTests.java:150: warning: [deprecation] <T>assertThat(T,Matcher<? super T>) in Assert has been deprecated
                assertThat(e, instanceOf(FatalStepExecutionException.class));
                ^
  where T is a type-variable:
    T extends Object declared in method <T>assertThat(T,Matcher<? super T>)
C:\opt\bamboo-home\xml-data\build-dir\BATCH-BATCHWIN-JOB1\spring-batch-core\src\test\java\org\springframework\batch\core\step\item\FaultTolerantStepFactoryBeanRollbackTests.java:151: warning: [deprecation] <T>assertThat(T,Matcher<? super T>) in Assert has been deprecated
                assertThat(e.getCause(), instanceOf(IllegalArgumentException.class));
                ^
  where T is a type-variable:
    T extends Object declared in method <T>assertThat(T,Matcher<? super T>)
C:\opt\bamboo-home\xml-data\build-dir\BATCH-BATCHWIN-JOB1\spring-batch-core\src\test\java\org\springframework\batch\core\step\item\FaultTolerantStepFactoryBeanTests.java:84: warning: [deprecation] none() in ExpectedException has been deprecated
        public ExpectedException expectedException = ExpectedException.none();
                                                                      ^
C:\opt\bamboo-home\xml-data\build-dir\BATCH-BATCHWIN-JOB1\spring-batch-core\src\test\java\org\springframework\batch\core\step\item\SimpleStepFactoryBeanTests.java:70: warning: [deprecation] none() in ExpectedException has been deprecated
        public ExpectedException expectedException = ExpectedException.none();
                                                                      ^
14 warnings

1917 tests completed, 1 failed, 7 skipped

FAILURE: Build failed with an exception.

* What went wrong:
Execution failed for task ':spring-batch-core:test'.
> There were failing tests. See the report at: file:///C:/opt/bamboo-home/xml-data/build-dir/BATCH-BATCHWIN-JOB1/spring-batch-core/build/reports/tests/test/index.html

* Try:
Run with --stacktrace option to get the stack trace. Run with --info or --debug option to get more log output. Run with --scan to get full insights.

* Get more help at https://help.gradle.org

BUILD FAILED in 3m 20s